program: Orca
programVersion: 4.2.1
elementType: O O O O N N N C C C C C C C C C C C C C C C C C C H H H H H H H H H H H H H H H H H H H H H H H
charge: 0
multiplicity: 1
keywords: wb97x-d3
keywords: def2-TZVPP
keywords: def2/J RIJCOSX GRIDX6 NOFINALGRIDX
keywords: grid4 nofinalgrid
keywords: scfconv7
keywords: smallprint printgap noloewdin
keywords: NOSOSCF
formula: C18H23N3O4
InChI: InChI=1/C18H23N3O4/c1-3-5-6-11-25-17(22)16(4-2)21(13-15-8-7-12-24-15)18(23)20-10-9-19-14-20/h3,7-10,12,14,16H,1,4-6,11,13H2,2H3
48 atoms
O  0.255047 -0.587531 0.795382
O  -3.477596 0.171779 -0.019371
O  -1.414681 -0.286799 2.25455
O  0.464871 0.84731 -2.23338
N  -0.517915 1.766921 -0.389691
N  1.811238 1.76252 -0.656197
N  3.984815 1.628076 -0.314389
C  -0.472112 1.618846 1.068336
C  -1.458561 2.53215 1.787882
C  -1.827692 1.638721 -1.026822
C  -0.633011 0.144671 1.455809
C  0.546817 1.395194 -1.164272
C  -1.099305 2.737968 3.253627
C  -2.464823 0.296937 -0.905904
C  0.189027 -2.009472 0.917379
C  1.125077 -2.597933 -0.115636
C  -2.233588 -0.897167 -1.506552
C  1.083126 -4.125855 -0.105595
C  2.176252 2.918184 0.002926
C  2.954235 1.035616 -0.827783
C  -3.163241 -1.816322 -0.938995
C  -3.885886 -1.10628 -0.041142
C  3.516229 2.808422 0.19656
C  1.946469 -4.712243 -1.176269
C  3.002878 -5.485035 -0.966295
H  0.530719 1.900457 1.398459
H  -1.447451 3.499489 1.278279
H  -2.474556 2.142441 1.714707
H  -1.707941 1.89419 -2.077672
H  -2.486691 2.393048 -0.596544
H  -1.134184 1.805212 3.812554
H  -0.100422 3.164023 3.363286
H  -1.800992 3.426578 3.722862
H  -0.837868 -2.343621 0.75047
H  0.476305 -2.306535 1.929952
H  2.148555 -2.262687 0.071269
H  0.845409 -2.225354 -1.105554
H  -1.488213 -1.088071 -2.260146
H  0.049214 -4.457542 -0.253119
H  1.394183 -4.505147 0.871606
H  1.476077 3.706374 0.220527
H  2.948378 0.077121 -1.322005
H  -3.281032 -2.860975 -1.174199
H  -4.69078 -1.368193 0.624809
H  4.174563 3.520279 0.66825
H  1.676118 -4.455856 -2.197104
H  3.597946 -5.867021 -1.784379
H  3.317144 -5.762803 0.032484
totalener: -1164.99688455 hartree
nucrepener: 2365.98496701 hartree
electener: -3530.98185156 hartree
oneelecener: -6288.22445977 hartree
twoeener: 2757.24260821 hartree
kineticenergy: 1160.08306919 hartree
xcener: -111.460795976556 hartree
chargesum: 0.0000000
charge: -0.262371 -0.247057 -0.329308 -0.363885 -0.143607 -0.002224 -0.302050 0.087984 -0.096904 -0.103053 0.232076 0.318081 -0.278961 0.200637 -0.036341 -0.106122 -0.259494 -0.059817 -0.185107 0.063965 -0.161756 0.005974 -0.067866 -0.177537 -0.208916 0.107301 0.079511 0.083624 0.130629 0.125079 0.103753 0.073040 0.091341 0.100157 0.118033 0.086712 0.075821 0.152642 0.078913 0.063783 0.169745 0.140332 0.142267 0.138477 0.130941 0.107434 0.103261 0.080859
qa: -0.2624 -0.2471 -0.3293 -0.3639 -0.1436 -0.0022 -0.3020 0.0880 -0.0969 -0.1031 0.2321 0.3181 -0.2790 0.2006 -0.0363 -0.1061 -0.2595 -0.0598 -0.1851 0.0640 -0.1618 0.0060 -0.0679 -0.1775 -0.2089 0.1073 0.0795 0.0836 0.1306 0.1251 0.1038 0.0730 0.0913 0.1002 0.1180 0.0867 0.0758 0.1526 0.0789 0.0638 0.1697 0.1403 0.1423 0.1385 0.1309 0.1074 0.1033 0.0809
va: 2.1344 2.3114 2.1579 2.1290 3.0265 3.2584 3.1318 3.9060 3.8623 3.9334 4.2667 4.2869 3.9576 3.4020 3.8738 3.8397 3.9637 3.8928 3.9010 4.0547 3.9149 3.9211 4.0596 3.8678 3.9780 1.0049 1.0089 1.0179 1.0099 1.0015 1.0122 1.0027 1.0041 1.0010 1.0058 1.0175 1.0203 1.0171 1.0067 1.0198 0.9964 1.0078 1.0038 1.0026 1.0081 1.0077 1.0089 1.0169
dispcorr: -0.028696528 hartree
energy: -1165.025581076407
dipole: 1.07947 -2.20875 -1.12928 -10.88664 10.99816 0.11152 7.19661 -6.76026 0.43635
magnitude: 1.21578 au
magnitude: 3.09026 debye
