program: Orca
programVersion: 4.2.1
elementType: O O O O N N N C C C C C C C C C C C C C C C C C C H H H H H H H H H H H H H H H H H H H H H H H
charge: 0
multiplicity: 1
keywords: wb97x-d3
keywords: def2-TZVPP
keywords: def2/J RIJCOSX GRIDX6 NOFINALGRIDX
keywords: grid4 nofinalgrid
keywords: scfconv7
keywords: smallprint printgap noloewdin
keywords: NOSOSCF
formula: C18H23N3O4
InChI: InChI=1/C18H23N3O4/c1-3-5-6-11-25-17(22)16(4-2)21(13-15-8-7-12-24-15)18(23)20-10-9-19-14-20/h3,7-10,12,14,16H,1,4-6,11,13H2,2H3
48 atoms
O  -0.388922 -2.940761 0.819355
O  -3.542302 1.295444 -0.110234
O  0.087227 -1.102548 2.011562
O  1.486252 -0.278626 -0.622791
N  -0.580053 0.505518 -0.103048
N  1.178203 1.966654 -0.639063
N  2.63221 3.621654 -0.729975
C  -1.077824 -0.863542 -0.077794
C  -1.09273 -1.546003 -1.449444
C  -1.272282 1.474313 0.749252
C  -0.364621 -1.635177 1.035717
C  0.728198 0.643026 -0.447995
C  -1.767531 -0.702927 -2.521327
C  -2.482564 2.092444 0.146026
C  0.213799 -3.828559 1.769289
C  1.583496 -4.283258 1.304512
C  -2.788659 3.372982 -0.176188
C  2.652829 -3.190311 1.303015
C  0.527915 3.025859 -1.237659
C  2.451952 2.38973 -0.375654
C  -4.126048 3.35666 -0.673322
C  -4.525974 2.067726 -0.611426
C  1.44535 4.026639 -1.279132
C  3.991624 -3.731996 0.914848
C  4.686736 -3.337398 -0.143491
H  -2.122959 -0.79477 0.241121
H  -0.084392 -1.813297 -1.760858
H  -1.636911 -2.484567 -1.338974
H  -0.58984 2.274651 1.027677
H  -1.529175 0.970206 1.685011
H  -1.824672 -1.261288 -3.45541
H  -2.784316 -0.426625 -2.240548
H  -1.222179 0.217347 -2.728803
H  -0.463872 -4.680719 1.83312
H  0.265473 -3.357758 2.752359
H  1.503547 -4.723696 0.307282
H  1.891552 -5.095683 1.970907
H  -2.140867 4.227824 -0.067405
H  2.709824 -2.746655 2.302464
H  2.378712 -2.384967 0.621056
H  -0.481453 2.954018 -1.603696
H  3.180096 1.744064 0.089257
H  -4.705416 4.192924 -1.026568
H  -5.443891 1.569597 -0.87537
H  1.321772 5.016921 -1.687451
H  4.401508 -4.510634 1.553788
H  5.651116 -3.764996 -0.382742
H  4.318085 -2.563939 -0.80668
totalener: -1164.99970016 hartree
nucrepener: 2302.76004971 hartree
electener: -3467.75974987 hartree
oneelecener: -6162.11913045 hartree
twoeener: 2694.35938058 hartree
kineticenergy: 1160.07414080 hartree
xcener: -111.460849510825 hartree
chargesum: -0.0000000
charge: -0.262844 -0.273766 -0.370464 -0.394769 -0.118560 -0.042485 -0.298640 0.033528 -0.103604 -0.086277 0.326373 0.351873 -0.267122 0.239844 -0.024496 -0.111033 -0.299806 -0.021079 -0.178369 0.056749 -0.131434 -0.029871 -0.082197 -0.188439 -0.210373 0.093195 0.095785 0.079000 0.138301 0.135027 0.097139 0.073511 0.082786 0.102374 0.101798 0.077492 0.066757 0.154031 0.081489 0.067741 0.184702 0.147165 0.143848 0.144127 0.132002 0.099829 0.099734 0.089431
qa: -0.2628 -0.2738 -0.3705 -0.3948 -0.1186 -0.0425 -0.2986 0.0335 -0.1036 -0.0863 0.3264 0.3519 -0.2671 0.2398 -0.0245 -0.1110 -0.2998 -0.0211 -0.1784 0.0567 -0.1314 -0.0299 -0.0822 -0.1884 -0.2104 0.0932 0.0958 0.0790 0.1383 0.1350 0.0971 0.0735 0.0828 0.1024 0.1018 0.0775 0.0668 0.1540 0.0815 0.0677 0.1847 0.1472 0.1438 0.1441 0.1320 0.0998 0.0997 0.0894
va: 2.1494 2.2806 2.1242 2.0995 3.0340 3.2851 3.1359 3.9675 3.8235 3.8950 4.2401 4.2427 3.9507 3.3677 3.9054 3.8531 4.0376 3.8609 3.9154 4.0489 3.9506 3.9355 4.0854 3.8739 3.9657 1.0183 1.0232 1.0189 0.9921 1.0166 1.0089 1.0073 1.0035 0.9984 1.0163 1.0181 1.0187 1.0092 1.0150 1.0354 0.9879 1.0081 1.0030 1.0012 1.0087 1.0090 1.0084 1.0189
dispcorr: -0.026624857 hartree
energy: -1165.026325021063
dipole: 2.69471 -4.82817 -2.13346 -17.08389 16.46887 -0.61503 -2.59682 2.61150 0.01468
magnitude: 2.22039 au
magnitude: 5.64378 debye
