program: Orca
programVersion: 4.2.1
elementType: O O O O N N N C C C C C C C C C C C C C C C C C C H H H H H H H H H H H H H H H H H H H H H H H
charge: 0
multiplicity: 1
keywords: wb97x-d3
keywords: def2-TZVPP
keywords: def2/J RIJCOSX GRIDX6 NOFINALGRIDX
keywords: grid4 nofinalgrid
keywords: scfconv7
keywords: smallprint printgap noloewdin
keywords: NOSOSCF
formula: C18H23N3O4
InChI: InChI=1/C18H23N3O4/c1-3-5-6-11-25-17(22)16(4-2)21(13-15-8-7-12-24-15)18(23)20-10-9-19-14-20/h3,7-10,12,14,16H,1,4-6,11,13H2,2H3
48 atoms
O  -0.028859 -0.935477 0.661546
O  -3.675508 0.424141 -0.108622
O  -1.735625 -0.606299 2.070931
O  0.375146 0.822132 -2.207963
N  -0.501072 1.627123 -0.260563
N  1.81495 1.348796 -0.54184
N  3.954142 0.894174 -0.261791
C  -0.504766 1.29347 1.167645
C  -1.377108 2.232727 1.992188
C  -1.806492 1.748298 -0.908482
C  -0.864398 -0.183745 1.36563
C  0.517361 1.21737 -1.079074
C  -1.040666 2.187186 3.477059
C  -2.612432 0.494943 -0.940038
C  -0.243492 -2.348579 0.611126
C  0.831393 -2.926385 -0.28324
C  -2.501239 -0.662288 -1.639505
C  2.229621 -2.818662 0.309515
C  2.317128 2.324576 0.294693
C  2.861806 0.526947 -0.853323
C  -3.565446 -1.499841 -1.196074
C  -4.237975 -0.784022 -0.264844
C  3.631875 2.020373 0.446855
C  3.345989 -3.221417 -0.601252
C  3.234709 -3.677895 -1.842591
H  0.519149 1.396713 1.533498
H  -1.214249 3.247988 1.620683
H  -2.434716 2.005161 1.85261
H  -1.638985 2.106162 -1.922272
H  -2.368834 2.527107 -0.393228
H  -1.646166 2.908385 4.024658
H  -1.23472 1.206396 3.905852
H  0.006604 2.436795 3.657248
H  -1.240444 -2.544753 0.210046
H  -0.198032 -2.768774 1.619724
H  0.786407 -2.422285 -1.253139
H  0.588828 -3.975875 -0.470541
H  -1.748573 -0.882106 -2.377945
H  2.285965 -3.425876 1.220569
H  2.423311 -1.794193 0.64203
H  1.721278 3.147772 0.649619
H  2.746277 -0.327063 -1.503376
H  -3.800238 -2.496454 -1.530977
H  -5.101387 -0.997601 0.342435
H  4.370418 2.557435 1.020332
H  4.340178 -3.106858 -0.180867
H  4.11088 -3.933019 -2.42248
H  2.280702 -3.817739 -2.334506
totalener: -1164.99729814 hartree
nucrepener: 2408.32980921 hartree
electener: -3573.32710735 hartree
oneelecener: -6373.09038423 hartree
twoeener: 2799.76327688 hartree
kineticenergy: 1160.07748808 hartree
xcener: -111.464226045205 hartree
chargesum: -0.0000000
charge: -0.261831 -0.248670 -0.329317 -0.365741 -0.147590 0.006351 -0.304047 0.093835 -0.099928 -0.104995 0.230756 0.320780 -0.277473 0.211088 -0.051006 -0.114928 -0.282039 -0.087159 -0.179500 0.047011 -0.144256 -0.000056 -0.069350 -0.166924 -0.220461 0.105950 0.078901 0.083669 0.130739 0.124445 0.091867 0.102598 0.073022 0.119933 0.110781 0.066756 0.091579 0.154908 0.084471 0.097816 0.170553 0.146658 0.145608 0.137328 0.130897 0.112477 0.105878 0.078619
qa: -0.2618 -0.2487 -0.3293 -0.3657 -0.1476 0.0064 -0.3040 0.0938 -0.0999 -0.1050 0.2308 0.3208 -0.2775 0.2111 -0.0510 -0.1149 -0.2820 -0.0872 -0.1795 0.0470 -0.1443 -0.0001 -0.0694 -0.1669 -0.2205 0.1060 0.0789 0.0837 0.1307 0.1244 0.0919 0.1026 0.0730 0.1199 0.1108 0.0668 0.0916 0.1549 0.0845 0.0978 0.1706 0.1467 0.1456 0.1373 0.1309 0.1125 0.1059 0.0786
va: 2.1273 2.3122 2.1600 2.1247 3.0266 3.2490 3.0939 3.8897 3.8653 3.9304 4.2744 4.2816 3.9555 3.3924 3.9032 3.8837 3.9598 3.8369 3.8994 4.0106 3.9110 3.9297 4.0563 3.8860 3.9356 1.0076 1.0093 1.0177 1.0097 1.0009 1.0039 1.0128 1.0026 1.0005 1.0064 1.0182 1.0127 1.0175 1.0069 1.0038 0.9954 1.0091 1.0010 1.0028 1.0080 1.0085 1.0112 1.0182
dispcorr: -0.030395690 hartree
energy: -1165.027693827590
dipole: 3.35504 -4.32914 -0.97410 -7.84863 8.04775 0.19912 7.39635 -6.77603 0.62033
magnitude: 1.17189 au
magnitude: 2.97870 debye
