program: Orca
programVersion: 4.2.1
elementType: O O O O N N N C C C C C C C C C C C C C C C C C C H H H H H H H H H H H H H H H H H H H H H H H
charge: 0
multiplicity: 1
keywords: wb97x-d3
keywords: def2-TZVPP
keywords: def2/J RIJCOSX GRIDX6 NOFINALGRIDX
keywords: grid4 nofinalgrid
keywords: scfconv7
keywords: smallprint printgap noloewdin
keywords: NOSOSCF
formula: C18H23N3O4
InChI: InChI=1/C18H23N3O4/c1-3-5-6-11-25-17(22)16(4-2)21(13-15-8-7-12-24-15)18(23)20-10-9-19-14-20/h3,7-10,12,14,16H,1,4-6,11,13H2,2H3
48 atoms
O  -0.260312 -1.206045 0.381945
O  -2.061721 -0.097447 -2.070794
O  -1.489217 -0.852116 2.218757
O  0.013895 3.230069 -1.510919
N  -0.579528 1.552841 -0.082779
N  1.665282 1.932588 -0.655182
N  3.486485 0.690979 -0.697143
C  -0.280084 0.991557 1.230572
C  -0.79704 1.864952 2.378063
C  -1.990777 1.682255 -0.432984
C  -0.770928 -0.454169 1.344549
C  0.308427 2.310989 -0.792001
C  -0.091169 1.583064 3.697847
C  -2.564156 0.404055 -0.925631
C  -0.558234 -2.607315 0.370813
C  0.296737 -3.385314 1.352956
C  -3.536988 -0.410673 -0.450947
C  1.804919 -3.221099 1.153419
C  2.731437 2.803043 -0.69246
C  2.191779 0.668456 -0.679216
C  -3.635687 -1.493233 -1.374913
C  -2.711297 -1.245397 -2.330926
C  3.837377 2.015675 -0.694682
C  2.271875 -3.661256 -0.198558
C  3.035469 -2.947585 -1.016269
H  0.806512 0.944251 1.331369
H  -0.627777 2.908006 2.09932
H  -1.873118 1.742163 2.509305
H  -2.083557 2.462606 -1.187419
H  -2.570692 2.015353 0.429245
H  0.987761 1.722095 3.607956
H  -0.442981 2.266222 4.470052
H  -0.275789 0.570245 4.049571
H  -0.35316 -2.916526 -0.653441
H  -1.619992 -2.761787 0.567181
H  0.028843 -4.440371 1.234767
H  0.024529 -3.120707 2.376255
H  -4.104119 -0.267915 0.454109
H  2.308703 -3.820818 1.918265
H  2.112174 -2.187831 1.332816
H  2.598521 3.870259 -0.710046
H  1.571143 -0.2124 -0.716969
H  -4.303611 -2.33694 -1.328866
H  -2.421073 -1.772123 -3.22483
H  4.869764 2.325558 -0.698171
H  1.956995 -4.656003 -0.507351
H  3.350779 -3.34046 -1.973785
H  3.398747 -1.958622 -0.759229
totalener: -1164.99775084 hartree
nucrepener: 2389.63590467 hartree
electener: -3554.63365550 hartree
oneelecener: -6335.63361319 hartree
twoeener: 2780.99995769 hartree
kineticenergy: 1160.08119161 hartree
xcener: -111.464536559142 hartree
chargesum: -0.0000000
charge: -0.255551 -0.250507 -0.339370 -0.356993 -0.126768 -0.051994 -0.320047 0.057793 -0.129653 -0.113845 0.257968 0.332789 -0.274812 0.212024 -0.027981 -0.149856 -0.209247 -0.079957 -0.113728 0.039048 -0.183929 -0.018356 -0.080537 -0.159703 -0.249924 0.108340 0.087336 0.074465 0.135285 0.128614 0.077854 0.091202 0.100463 0.114924 0.123158 0.080684 0.099261 0.138914 0.089440 0.069887 0.157182 0.170432 0.141245 0.145440 0.129096 0.109724 0.097398 0.122791
qa: -0.2556 -0.2505 -0.3394 -0.3570 -0.1268 -0.0520 -0.3200 0.0578 -0.1297 -0.1138 0.2580 0.3328 -0.2748 0.2120 -0.0280 -0.1499 -0.2092 -0.0800 -0.1137 0.0390 -0.1839 -0.0184 -0.0805 -0.1597 -0.2499 0.1083 0.0873 0.0745 0.1353 0.1286 0.0779 0.0912 0.1005 0.1149 0.1232 0.0807 0.0993 0.1389 0.0894 0.0699 0.1572 0.1704 0.1412 0.1454 0.1291 0.1097 0.0974 0.1228
va: 2.0939 2.3007 2.1432 2.1513 3.0387 3.3098 3.0730 3.9089 3.9148 3.9215 4.2741 4.2773 3.9519 3.4748 3.8116 3.8960 3.9617 3.8683 3.9236 3.9418 3.9257 3.8936 4.0365 3.7886 3.9405 0.9903 1.0087 1.0114 1.0295 0.9971 1.0022 1.0047 1.0110 0.9988 1.0077 1.0119 1.0232 1.0122 1.0102 1.0175 1.0080 1.0154 1.0043 1.0002 1.0056 1.0041 1.0157 1.0285
dispcorr: -0.029341859 hartree
energy: -1165.027092696968
dipole: 3.02914 -3.92701 -0.89787 -12.20926 11.66413 -0.54513 13.55356 -12.85697 0.69660
magnitude: 1.26039 au
magnitude: 3.20366 debye
