program: Orca
programVersion: 4.2.1
elementType: O O O O N N N C C C C C C C C C C C C C C C C C C H H H H H H H H H H H H H H H H H H H H H H H
charge: 0
multiplicity: 1
keywords: wb97x-d3
keywords: def2-TZVPP
keywords: def2/J RIJCOSX GRIDX6 NOFINALGRIDX
keywords: grid4 nofinalgrid
keywords: scfconv7
keywords: smallprint printgap noloewdin
keywords: NOSOSCF
formula: C18H23N3O4
InChI: InChI=1/C18H23N3O4/c1-3-5-6-11-25-17(22)16(4-2)21(13-15-8-7-12-24-15)18(23)20-10-9-19-14-20/h3,7-10,12,14,16H,1,4-6,11,13H2,2H3
48 atoms
O  0.318578 -1.017951 0.848317
O  -3.447038 0.201218 0.168939
O  -1.340835 -0.718834 2.325276
O  0.64483 0.686603 -2.050035
N  -0.314622 1.502147 -0.141966
N  2.009331 1.485329 -0.422481
N  3.639353 2.651736 0.502018
C  -0.287735 1.208794 1.293174
C  -1.226236 2.093063 2.104448
C  -1.630033 1.50162 -0.781795
C  -0.538555 -0.282805 1.55014
C  0.738816 1.162283 -0.947493
C  -0.922739 3.576093 1.953984
C  -2.38622 0.223262 -0.669372
C  0.239157 -2.442252 0.971367
C  1.521865 -3.041568 0.436928
C  -2.224368 -0.998596 -1.233633
C  1.732274 -2.910377 -1.071576
C  3.176897 0.811861 -0.696209
C  2.363644 2.598366 0.294518
C  -3.249342 -1.827046 -0.694353
C  -3.954978 -1.041143 0.151627
C  4.158682 1.537071 -0.101857
C  0.748996 -3.695002 -1.881515
C  0.093572 -3.231941 -2.937852
H  0.726522 1.395317 1.653574
H  -2.268298 1.884604 1.861008
H  -1.115945 1.805905 3.150881
H  -1.485039 1.755255 -1.829835
H  -2.219159 2.309746 -0.345435
H  -0.995466 3.912856 0.918954
H  -1.623543 4.170241 2.539122
H  0.079691 3.818147 2.311259
H  -0.635725 -2.796346 0.419057
H  0.103287 -2.713779 2.019868
H  1.517563 -4.102697 0.70492
H  2.369746 -2.602266 0.968703
H  -1.457662 -1.278214 -1.935238
H  2.739922 -3.274011 -1.299747
H  1.704893 -1.863756 -1.379704
H  3.193141 -0.099024 -1.267148
H  1.639744 3.339855 0.59487
H  -3.432438 -2.866097 -0.911196
H  -4.808966 -1.222492 0.782278
H  5.214797 1.322907 -0.07623
H  0.59635 -4.728711 -1.579178
H  -0.584524 -3.855561 -3.504634
H  0.224417 -2.212617 -3.282701
totalener: -1164.99696706 hartree
nucrepener: 2426.41199009 hartree
electener: -3591.40895715 hartree
oneelecener: -6409.18382216 hartree
twoeener: 2817.77486501 hartree
kineticenergy: 1160.07691262 hartree
xcener: -111.464876819916 hartree
chargesum: 0.0000000
charge: -0.255260 -0.254592 -0.327612 -0.366110 -0.132489 0.009601 -0.294334 0.016424 -0.067265 -0.132030 0.260298 0.306748 -0.287695 0.217591 -0.037396 -0.119472 -0.267590 -0.024555 -0.123369 -0.012575 -0.149219 0.008883 -0.079480 -0.177027 -0.257079 0.120803 0.080730 0.086322 0.127558 0.126111 0.081906 0.104704 0.078685 0.102543 0.116686 0.076552 0.079868 0.162366 0.096950 0.034701 0.164651 0.168238 0.142482 0.136141 0.131869 0.106555 0.108084 0.111097
qa: -0.2553 -0.2546 -0.3276 -0.3661 -0.1325 0.0096 -0.2943 0.0164 -0.0673 -0.1320 0.2603 0.3067 -0.2877 0.2176 -0.0374 -0.1195 -0.2676 -0.0246 -0.1234 -0.0126 -0.1492 0.0089 -0.0795 -0.1770 -0.2571 0.1208 0.0807 0.0863 0.1276 0.1261 0.0819 0.1047 0.0787 0.1025 0.1167 0.0766 0.0799 0.1624 0.0970 0.0347 0.1647 0.1682 0.1425 0.1361 0.1319 0.1066 0.1081 0.1111
va: 2.1296 2.3085 2.1702 2.1185 2.9870 3.2634 3.1392 3.9435 3.8453 3.9258 4.3142 4.2760 3.9413 3.4014 3.8743 3.8965 3.9165 3.8372 3.9362 4.0485 3.9352 3.9278 4.0465 3.8314 3.9555 1.0004 1.0243 1.0200 1.0135 0.9971 1.0041 1.0090 1.0007 0.9936 1.0136 1.0131 1.0221 1.0177 1.0024 1.0448 0.9985 0.9955 1.0036 1.0026 1.0075 1.0088 1.0100 1.0101
dispcorr: -0.031593131 hartree
energy: -1165.028560190362
dipole: -0.08764 -0.54066 -0.62830 -7.41195 6.68765 -0.72430 0.92783 -0.72576 0.20206
magnitude: 0.97990 au
magnitude: 2.49070 debye
