program: Orca
programVersion: 4.2.1
elementType: O O O O N N N C C C C C C C C C C C C C C C C C C H H H H H H H H H H H H H H H H H H H H H H H
charge: 0
multiplicity: 1
keywords: wb97x-d3
keywords: def2-TZVPP
keywords: def2/J RIJCOSX GRIDX6 NOFINALGRIDX
keywords: grid4 nofinalgrid
keywords: scfconv7
keywords: smallprint printgap noloewdin
keywords: NOSOSCF
formula: C18H23N3O4
InChI: InChI=1/C18H23N3O4/c1-3-5-6-11-25-17(22)16(4-2)21(13-15-8-7-12-24-15)18(23)20-10-9-19-14-20/h3,7-10,12,14,16H,1,4-6,11,13H2,2H3
48 atoms
O  0.985898 -0.864659 1.788325
O  -1.899257 -1.148657 -0.810813
O  -1.028919 -0.484202 2.683546
O  -0.539498 2.621487 -1.720321
N  -0.475469 1.338445 0.15132
N  1.504026 2.057942 -0.916023
N  3.595878 1.354578 -0.967208
C  0.088823 1.300866 1.501289
C  -0.52722 2.351024 2.423957
C  -1.921036 1.126921 0.014858
C  -0.07002 -0.111542 2.065876
C  0.091387 2.04863 -0.870645
C  0.17414 2.426159 3.773226
C  -2.238978 0.138424 -1.042845
C  0.986723 -2.231286 2.222386
C  0.32362 -3.162016 1.226597
C  -2.8283 0.247008 -2.255498
C  0.970855 -3.138188 -0.149598
C  2.246047 3.070001 -1.484889
C  2.383826 1.040745 -0.642344
C  -2.856925 -1.068519 -2.806344
C  -2.2752 -1.869073 -1.885439
C  3.526352 2.621488 -1.484925
C  0.478943 -4.177948 -1.106652
C  -0.453358 -5.0958 -0.880227
H  1.154533 1.512337 1.427016
H  -0.450479 3.316785 1.918054
H  -1.590535 2.157776 2.574356
H  -2.43413 2.063152 -0.208647
H  -2.301377 0.77499 0.973097
H  0.050745 1.508565 4.348037
H  1.243313 2.613845 3.65996
H  -0.237521 3.237747 4.371654
H  0.510528 -2.311518 3.200668
H  2.042352 -2.480685 2.335044
H  -0.741698 -2.934299 1.154179
H  0.398363 -4.167388 1.652075
H  -3.181465 1.158334 -2.707845
H  2.056718 -3.255402 -0.051727
H  0.830142 -2.157238 -0.6140
H  1.796717 3.986544 -1.823489
H  2.066226 0.097266 -0.228705
H  -3.250851 -1.370708 -3.762021
H  -2.055387 -2.923658 -1.854932
H  4.407286 3.13648 -1.83235
H  0.952581 -4.155978 -2.083606
H  -0.730573 -5.808312 -1.645194
H  -0.975214 -5.182826 0.064187
totalener: -1164.99824038 hartree
nucrepener: 2358.60302793 hartree
electener: -3523.60126831 hartree
oneelecener: -6273.51447672 hartree
twoeener: 2749.91320842 hartree
kineticenergy: 1160.07564267 hartree
xcener: -111.459880793200 hartree
chargesum: -0.0000000
charge: -0.264336 -0.265289 -0.349711 -0.357178 -0.129365 -0.052932 -0.296818 0.017280 -0.121834 -0.108090 0.307618 0.343314 -0.270732 0.169922 -0.039490 -0.111559 -0.212403 -0.051132 -0.107479 0.026270 -0.159556 -0.013225 -0.081513 -0.188856 -0.239860 0.118906 0.083676 0.079320 0.130881 0.138423 0.096150 0.083496 0.093338 0.113634 0.109202 0.095939 0.083597 0.138836 0.086091 0.066728 0.158531 0.141413 0.137190 0.157659 0.130412 0.113360 0.114194 0.085976
qa: -0.2643 -0.2653 -0.3497 -0.3572 -0.1294 -0.0529 -0.2968 0.0173 -0.1218 -0.1081 0.3076 0.3433 -0.2707 0.1699 -0.0395 -0.1116 -0.2124 -0.0511 -0.1075 0.0263 -0.1596 -0.0132 -0.0815 -0.1889 -0.2399 0.1189 0.0837 0.0793 0.1309 0.1384 0.0962 0.0835 0.0933 0.1136 0.1092 0.0959 0.0836 0.1388 0.0861 0.0667 0.1585 0.1414 0.1372 0.1577 0.1304 0.1134 0.1142 0.0860
va: 2.1279 2.2801 2.1291 2.1494 2.9985 3.2684 3.1405 3.9534 3.9027 3.8658 4.1743 4.2638 3.9415 3.5115 3.9057 3.8187 4.0360 3.8296 3.9244 4.0356 4.0008 3.8801 4.0346 3.8886 3.9186 1.0066 1.0105 1.0179 1.0098 1.0159 1.0094 1.0016 1.0044 1.0134 0.9943 1.0227 1.0121 1.0147 1.0075 1.0155 1.0085 1.0190 1.0060 1.0047 1.0076 1.0067 1.0089 1.0191
dispcorr: -0.027969685 hartree
energy: -1165.026210062875
dipole: -0.53666 0.20471 -0.33194 -10.67852 10.46106 -0.21746 10.14087 -9.34824 0.79263
magnitude: 0.88642 au
magnitude: 2.25310 debye
