program: Orca
programVersion: 4.2.1
elementType: O O O O N N N C C C C C C C C C C C C C C C C C C H H H H H H H H H H H H H H H H H H H H H H H
charge: 0
multiplicity: 1
keywords: wb97x-d3
keywords: def2-TZVPP
keywords: def2/J RIJCOSX GRIDX6 NOFINALGRIDX
keywords: grid4 nofinalgrid
keywords: scfconv7
keywords: smallprint printgap noloewdin
keywords: NOSOSCF
formula: C18H23N3O4
InChI: InChI=1/C18H23N3O4/c1-3-5-6-11-25-17(22)16(4-2)21(13-15-8-7-12-24-15)18(23)20-10-9-19-14-20/h3,7-10,12,14,16H,1,4-6,11,13H2,2H3
48 atoms
O  0.388272 -0.733005 0.489631
O  -3.334949 0.038106 0.247844
O  -0.966679 -0.642018 2.269744
O  0.306215 1.075405 -2.286639
N  -0.472436 1.743348 -0.246684
N  1.814438 1.812955 -0.762088
N  3.521684 2.96617 0.026673
C  -0.274709 1.408014 1.166144
C  -1.195034 2.178676 2.103289
C  -1.840771 1.665379 -0.758073
C  -0.360138 -0.106035 1.386994
C  0.502975 1.486914 -1.172617
C  -1.037336 3.686203 1.976202
C  -2.453734 0.306997 -0.742132
C  0.386396 -2.162401 0.481218
C  1.186045 -2.605328 -0.725228
C  -2.309919 -0.785102 -1.533495
C  1.211147 -4.128505 -0.863493
C  2.950853 1.158193 -1.173146
C  2.231318 2.906921 -0.051276
C  -3.15635 -1.791605 -0.983752
C  -3.747545 -1.230109 0.096918
C  3.983975 1.874891 -0.660247
C  1.917721 -4.805717 0.26831
C  1.373354 -5.692475 1.090432
H  0.749886 1.67816 1.433912
H  -2.235437 1.881879 1.964726
H  -0.946601 1.872793 3.120279
H  -1.832489 2.048292 -1.776319
H  -2.459668 2.349552 -0.176259
H  -0.018631 4.001313 2.209519
H  -1.271752 4.048503 0.974417
H  -1.699286 4.200269 2.67206
H  -0.642796 -2.525826 0.420006
H  0.817983 -2.54056 1.410733
H  2.2096 -2.225558 -0.648637
H  0.752963 -2.164017 -1.626348
H  -1.672197 -0.855743 -2.398548
H  1.71433 -4.379138 -1.80204
H  0.190916 -4.513395 -0.950114
H  2.908563 0.263563 -1.76845
H  1.537055 3.632359 0.344497
H  -3.309113 -2.793426 -1.3492
H  -4.455929 -1.59691 0.820583
H  5.038573 1.669685 -0.747943
H  2.95857 -4.526015 0.411793
H  1.939613 -6.145631 1.892493
H  0.339714 -6.001882 0.992305
totalener: -1164.99724746 hartree
nucrepener: 2375.60310382 hartree
electener: -3540.60035128 hartree
oneelecener: -6307.43617042 hartree
twoeener: 2766.83581914 hartree
kineticenergy: 1160.07913114 hartree
xcener: -111.462368227702 hartree
chargesum: -0.0000000
charge: -0.257453 -0.249441 -0.322283 -0.362875 -0.135043 -0.000208 -0.295256 0.013453 -0.068825 -0.109747 0.245798 0.324076 -0.280167 0.198623 -0.025050 -0.112502 -0.254429 -0.087730 -0.111528 -0.009442 -0.164508 0.004026 -0.078734 -0.176095 -0.203220 0.119053 0.078359 0.087846 0.129037 0.125894 0.076663 0.082673 0.104423 0.099973 0.123033 0.068030 0.090300 0.152764 0.089191 0.068287 0.151847 0.162270 0.141272 0.138788 0.130350 0.110258 0.105331 0.082921
qa: -0.2575 -0.2494 -0.3223 -0.3629 -0.1350 -0.0002 -0.2953 0.0135 -0.0688 -0.1097 0.2458 0.3241 -0.2802 0.1986 -0.0250 -0.1125 -0.2544 -0.0877 -0.1115 -0.0094 -0.1645 0.0040 -0.0787 -0.1761 -0.2032 0.1191 0.0784 0.0878 0.1290 0.1259 0.0767 0.0827 0.1044 0.1000 0.1230 0.0680 0.0903 0.1528 0.0892 0.0683 0.1518 0.1623 0.1413 0.1388 0.1303 0.1103 0.1053 0.0829
va: 2.1292 2.3081 2.1786 2.1319 2.9904 3.2674 3.1372 3.9491 3.8537 3.9419 4.3215 4.2699 3.9373 3.4024 3.8474 3.8500 3.9767 3.9201 3.9383 4.0514 3.9128 3.9206 4.0329 3.8494 3.9600 1.0006 1.0229 1.0204 1.0113 0.9996 1.0022 1.0057 1.0085 1.0021 1.0145 1.0155 1.0174 1.0175 1.0077 1.0137 1.0073 0.9965 1.0043 1.0028 1.0076 1.0073 1.0089 1.0154
dispcorr: -0.029354243 hartree
energy: -1165.026601706312
dipole: 0.33333 -1.11551 -0.78218 -11.48083 10.78060 -0.70023 4.96109 -4.96051 0.00058
magnitude: 1.04983 au
magnitude: 2.66845 debye
