program: Orca
programVersion: 4.2.1
elementType: O O O O N N N C C C C C C C C C C C C C C C C C C H H H H H H H H H H H H H H H H H H H H H H H
charge: 0
multiplicity: 1
keywords: wb97x-d3
keywords: def2-TZVPP
keywords: def2/J RIJCOSX GRIDX6 NOFINALGRIDX
keywords: grid4 nofinalgrid
keywords: scfconv7
keywords: smallprint printgap noloewdin
keywords: NOSOSCF
formula: C18H23N3O4
InChI: InChI=1/C18H23N3O4/c1-3-5-6-11-25-17(22)16(4-2)21(13-15-8-7-12-24-15)18(23)20-10-9-19-14-20/h3,7-10,12,14,16H,1,4-6,11,13H2,2H3
48 atoms
O  0.945583 -1.755584 1.203486
O  -3.697746 0.32175 0.01009
O  -0.511176 -1.566737 2.88814
O  0.11389 1.1847 -2.067693
N  -0.309188 0.310223 -0.028665
N  1.65941 1.557068 -0.451494
N  3.725542 1.719183 0.310346
C  -0.155202 0.321209 1.416476
C  -1.286188 1.037405 2.151238
C  -1.459623 -0.401412 -0.58745
C  0.046415 -1.104053 1.934048
C  0.43604 1.006821 -0.917613
C  -1.449901 2.479783 1.696692
C  -2.667497 0.43014 -0.860662
C  1.266674 -3.098455 1.575741
C  2.441454 -3.567513 0.745894
C  -2.994336 1.30637 -1.843054
C  2.166491 -3.767622 -0.744983
C  2.132984 2.785572 -0.852245
C  2.68293 0.955054 0.233769
C  -4.307594 1.773194 -1.544696
C  -4.679121 1.138907 -0.409703
C  3.393085 2.868801 -0.353151
C  1.929719 -2.514543 -1.527718
C  0.952195 -2.337914 -2.406613
H  0.761713 0.864215 1.654685
H  -2.224963 0.493223 2.050289
H  -1.045292 1.014313 3.215269
H  -1.731959 -1.200869 0.104045
H  -1.135615 -0.890567 -1.504555
H  -1.7552 2.554458 0.653043
H  -2.213403 2.979159 2.291819
H  -0.523459 3.045628 1.814446
H  0.393965 -3.738454 1.416999
H  1.511987 -3.137617 2.639466
H  2.759677 -4.523595 1.16985
H  3.285894 -2.885772 0.886932
H  -2.370219 1.587432 -2.673157
H  1.327089 -4.456216 -0.87982
H  3.040494 -4.271692 -1.171075
H  1.536783 3.463457 -1.437013
H  2.606939 -0.049165 0.617986
H  -4.893742 2.482158 -2.105008
H  -5.576767 1.161248 0.185506
H  4.083645 3.692304 -0.435916
H  2.656143 -1.718284 -1.386678
H  0.862357 -1.423462 -2.977104
H  0.20907 -3.104798 -2.593322
totalener: -1164.99765208 hartree
nucrepener: 2377.41711752 hartree
electener: -3542.41476959 hartree
oneelecener: -6311.07027154 hartree
twoeener: 2768.65550195 hartree
kineticenergy: 1160.07402398 hartree
xcener: -111.462615928340 hartree
chargesum: 0.0000000
charge: -0.258018 -0.257566 -0.327317 -0.385449 -0.049175 -0.003284 -0.297685 -0.035280 -0.103721 -0.047086 0.293262 0.280275 -0.268027 0.119311 -0.008326 -0.153145 -0.230254 -0.056122 -0.115619 -0.008950 -0.131860 -0.030706 -0.076093 -0.116859 -0.288450 0.115317 0.088923 0.091423 0.114437 0.143677 0.088212 0.100063 0.086801 0.094696 0.106252 0.088871 0.080817 0.155223 0.063291 0.090055 0.153865 0.147721 0.139128 0.141582 0.130630 0.116038 0.127583 0.091541
qa: -0.2580 -0.2576 -0.3273 -0.3854 -0.0492 -0.0033 -0.2977 -0.0353 -0.1037 -0.0471 0.2933 0.2803 -0.2680 0.1193 -0.0083 -0.1531 -0.2303 -0.0561 -0.1156 -0.0090 -0.1319 -0.0307 -0.0761 -0.1169 -0.2885 0.1153 0.0889 0.0914 0.1144 0.1437 0.0882 0.1001 0.0868 0.0947 0.1063 0.0889 0.0808 0.1552 0.0633 0.0901 0.1539 0.1477 0.1391 0.1416 0.1306 0.1160 0.1276 0.0915
va: 2.1208 2.2852 2.1777 2.1027 3.0080 3.2490 3.1487 4.0107 3.8581 3.8638 4.2320 4.2710 3.9345 3.5446 3.8749 3.9210 3.9988 3.8573 3.9221 4.0294 3.9454 3.9137 4.0254 3.7727 3.9534 0.9975 1.0293 1.0216 1.0163 1.0030 1.0089 1.0076 1.0046 1.0013 1.0058 1.0134 1.0113 1.0216 1.0137 1.0043 1.0103 1.0228 1.0046 1.0026 1.0076 1.0067 1.0132 1.0112
dispcorr: -0.030308450 hartree
energy: -1165.027960525483
dipole: 1.22085 -1.89545 -0.67460 -7.87179 7.30194 -0.56986 1.21009 -1.04285 0.16723
magnitude: 0.89877 au
magnitude: 2.28450 debye
