program: Orca
programVersion: 4.2.1
elementType: O O O O N N N C C C C C C C C C C C C C C C C C C H H H H H H H H H H H H H H H H H H H H H H H
charge: 0
multiplicity: 1
keywords: wb97x-d3
keywords: def2-TZVPP
keywords: def2/J RIJCOSX GRIDX6 NOFINALGRIDX
keywords: grid4 nofinalgrid
keywords: scfconv7
keywords: smallprint printgap noloewdin
keywords: NOSOSCF
formula: C18H23N3O4
InChI: InChI=1/C18H23N3O4/c1-3-5-6-11-25-17(22)16(4-2)21(13-15-8-7-12-24-15)18(23)20-10-9-19-14-20/h3,7-10,12,14,16H,1,4-6,11,13H2,2H3
48 atoms
O  0.076088 -1.752099 0.525226
O  -2.713676 0.309721 -1.695901
O  0.020426 -0.834842 -1.508119
O  -0.338156 3.903477 -0.679951
N  -0.367051 1.671715 -0.241503
N  1.52976 2.716635 -1.163808
N  3.578271 3.392408 -1.624576
C  0.382652 0.598513 0.394144
C  0.212762 0.580493 1.91715
C  -1.800021 1.730966 0.039307
C  0.111101 -0.730811 -0.316097
C  0.208503 2.829451 -0.678124
C  0.576215 1.914633 2.553717
C  -2.512774 0.499355 -0.378362
C  -0.138727 -3.056236 -0.023438
C  -0.13656 -4.045984 1.119711
C  -3.031478 -0.541858 0.319965
C  1.197167 -4.12976 1.863246
C  2.098573 1.732007 -1.947838
C  2.473088 3.698289 -1.025295
C  -3.578726 -1.437676 -0.645143
C  -3.345742 -0.8629 -1.848317
C  3.35417 2.176089 -2.213003
C  1.189151 -5.198813 2.908444
C  1.348838 -4.99299 4.208569
H  1.444312 0.788239 0.211508
H  -0.79987 0.286854 2.200669
H  0.866026 -0.195354 2.317769
H  -2.205879 2.597525 -0.479879
H  -1.985409 1.897491 1.104022
H  0.537116 1.840802 3.640103
H  1.589092 2.221866 2.286336
H  -0.097741 2.720484 2.261551
H  0.648917 -3.288885 -0.745718
H  -1.09246 -3.070024 -0.556019
H  -0.383593 -5.025631 0.699583
H  -0.938722 -3.805848 1.822251
H  -3.026597 -0.658739 1.391436
H  1.435545 -3.16771 2.321275
H  1.993208 -4.337265 1.138914
H  1.553005 0.861257 -2.268438
H  2.278356 4.598094 -0.463506
H  -4.082498 -2.372464 -0.464921
H  -3.573534 -1.160501 -2.858229
H  4.110112 1.689863 -2.808484
H  1.026403 -6.213357 2.553694
H  1.326393 -5.80669 4.920384
H  1.51128 -4.00073 4.61222
totalener: -1164.99830353 hartree
nucrepener: 2314.89377686 hartree
electener: -3479.89208039 hartree
oneelecener: -6185.77606404 hartree
twoeener: 2705.88398365 hartree
kineticenergy: 1160.07716614 hartree
xcener: -111.463748461112 hartree
chargesum: -0.0000000
charge: -0.259205 -0.236626 -0.363430 -0.365185 -0.095198 -0.038742 -0.299917 -0.001732 -0.106727 -0.133371 0.323922 0.323817 -0.265978 0.199474 -0.033886 -0.106613 -0.207128 -0.034784 -0.191147 0.053430 -0.216581 0.028702 -0.074434 -0.177252 -0.211365 0.117181 0.072904 0.077521 0.129558 0.123637 0.102211 0.086515 0.083365 0.106983 0.115645 0.070614 0.076102 0.132427 0.062986 0.074382 0.204496 0.144437 0.145785 0.141824 0.131247 0.106261 0.103633 0.080243
qa: -0.2592 -0.2366 -0.3634 -0.3652 -0.0952 -0.0387 -0.2999 -0.0017 -0.1067 -0.1334 0.3239 0.3238 -0.2660 0.1995 -0.0339 -0.1066 -0.2071 -0.0348 -0.1911 0.0534 -0.2166 0.0287 -0.0744 -0.1773 -0.2114 0.1172 0.0729 0.0775 0.1296 0.1236 0.1022 0.0865 0.0834 0.1070 0.1156 0.0706 0.0761 0.1324 0.0630 0.0744 0.2045 0.1444 0.1458 0.1418 0.1312 0.1063 0.1036 0.0802
va: 2.1333 2.3342 2.1165 2.1361 3.0308 3.2720 3.1366 3.9573 3.8958 3.9284 4.1684 4.2805 3.9394 3.5115 3.8657 3.8894 3.9154 3.8460 3.8853 4.0395 3.9536 3.9074 4.0635 3.8672 3.9751 0.9959 1.0124 1.0190 1.0317 0.9960 1.0063 1.0048 1.0118 1.0061 1.0092 1.0189 1.0210 1.0108 1.0269 1.0106 1.0075 1.0087 1.0027 1.0003 1.0093 1.0075 1.0088 1.0167
dispcorr: -0.027268724 hartree
energy: -1165.025572253306
dipole: 1.69820 -2.74445 -1.04625 -22.09140 19.82789 -2.26351 21.23950 -19.90481 1.33469
magnitude: 2.82834 au
magnitude: 7.18907 debye
