program: Orca
programVersion: 4.2.1
elementType: O O O O N N N C C C C C C C C C C C C C C C C C C H H H H H H H H H H H H H H H H H H H H H H H
charge: 0
multiplicity: 1
keywords: wb97x-d3
keywords: def2-TZVPP
keywords: def2/J RIJCOSX GRIDX6 NOFINALGRIDX
keywords: grid4 nofinalgrid
keywords: scfconv7
keywords: smallprint printgap noloewdin
keywords: NOSOSCF
formula: C18H23N3O4
InChI: InChI=1/C18H23N3O4/c1-3-5-6-11-25-17(22)16(4-2)21(13-15-8-7-12-24-15)18(23)20-10-9-19-14-20/h3,7-10,12,14,16H,1,4-6,11,13H2,2H3
48 atoms
O  -0.193816 -1.148332 0.472499
O  -3.175027 -0.198365 0.084491
O  -1.010532 -0.943425 2.542967
O  0.438118 1.070929 -2.099079
N  -0.414145 1.488303 -0.029292
N  1.908318 1.45599 -0.420877
N  4.096549 1.183159 -0.339596
C  -0.328128 1.041386 1.359156
C  -1.201356 1.859213 2.308308
C  -1.742682 1.620401 -0.626785
C  -0.581904 -0.460219 1.532858
C  0.596851 1.298258 -0.927215
C  -0.884047 3.346031 2.282386
C  -2.452255 0.347816 -0.918993
C  -0.34582 -2.573439 0.520755
C  0.047126 -3.137442 -0.824909
C  -2.530609 -0.434728 -2.020763
C  1.5096 -2.902585 -1.207285
C  2.384255 2.356677 0.510271
C  3.000436 0.797113 -0.911081
C  -3.357061 -1.541654 -1.665949
C  -3.713134 -1.342728 -0.375836
C  3.728114 2.16387 0.540732
C  2.468948 -3.502236 -0.229586
C  3.365463 -2.829668 0.480322
H  0.705472 1.176089 1.689092
H  -2.259893 1.68521 2.105649
H  -1.036891 1.470067 3.312377
H  -1.636265 2.180655 -1.55299
H  -2.349149 2.237836 0.037024
H  0.142673 3.538255 2.598964
H  -1.012039 3.786527 1.293002
H  -1.535218 3.887362 2.967667
H  -1.384689 -2.819216 0.748186
H  0.279428 -2.977156 1.32073
H  -0.608006 -2.724591 -1.595145
H  -0.154196 -4.2126 -0.791003
H  -2.040129 -0.24999 -2.961554
H  1.695162 -1.833243 -1.31493
H  1.677256 -3.341868 -2.195266
H  1.748444 3.066399 1.009455
H  2.9157 0.046521 -1.680231
H  -3.649571 -2.369816 -2.28979
H  -4.329013 -1.897311 0.312389
H  4.455174 2.686875 1.140983
H  2.400643 -4.579873 -0.099211
H  4.027883 -3.332184 1.17217
H  3.486053 -1.756405 0.393043
totalener: -1164.99820379 hartree
nucrepener: 2425.54745084 hartree
electener: -3590.54565463 hartree
oneelecener: -6407.39821425 hartree
twoeener: 2816.85255961 hartree
kineticenergy: 1160.08943716 hartree
xcener: -111.467442765278 hartree
chargesum: 0.0000000
charge: -0.251445 -0.253122 -0.340345 -0.365391 -0.118286 -0.001033 -0.308018 0.011993 -0.068954 -0.113038 0.269523 0.332656 -0.283914 0.207731 -0.059876 -0.145564 -0.251156 -0.026623 -0.189138 0.027217 -0.145195 -0.046813 -0.069577 -0.190947 -0.208959 0.118207 0.076205 0.095103 0.125932 0.129249 0.072752 0.085606 0.105536 0.118941 0.125836 0.090535 0.079622 0.149659 0.033401 0.087675 0.188430 0.166267 0.141999 0.147924 0.132770 0.107415 0.102567 0.106644
qa: -0.2514 -0.2531 -0.3403 -0.3654 -0.1183 -0.0010 -0.3080 0.0120 -0.0690 -0.1130 0.2695 0.3327 -0.2839 0.2077 -0.0599 -0.1456 -0.2512 -0.0266 -0.1891 0.0272 -0.1452 -0.0468 -0.0696 -0.1909 -0.2090 0.1182 0.0762 0.0951 0.1259 0.1292 0.0728 0.0856 0.1055 0.1189 0.1258 0.0905 0.0796 0.1497 0.0334 0.0877 0.1884 0.1663 0.1420 0.1479 0.1328 0.1074 0.1026 0.1066
va: 2.1250 2.2814 2.1666 2.1317 2.9946 3.2474 3.0953 3.9554 3.8449 3.9565 4.2787 4.2473 3.9323 3.3732 3.8458 3.9141 3.9912 3.8626 3.8914 4.0255 3.8843 3.8891 4.0586 3.8514 3.9387 1.0005 1.0177 1.0262 1.0136 0.9970 1.0035 1.0056 1.0079 1.0048 1.0090 1.0165 1.0140 1.0182 1.0452 1.0108 0.9894 0.9928 1.0032 1.0007 1.0080 1.0062 1.0113 1.0142
dispcorr: -0.031171545 hartree
energy: -1165.029375338134
dipole: 0.38996 -1.69835 -1.30839 -5.00555 5.09566 0.09010 4.74875 -4.51308 0.23566
magnitude: 1.33249 au
magnitude: 3.38692 debye
