program: Orca
programVersion: 4.2.1
elementType: O O O O N N N C C C C C C C C C C C C C C C C C C H H H H H H H H H H H H H H H H H H H H H H H
charge: 0
multiplicity: 1
keywords: wb97x-d3
keywords: def2-TZVPP
keywords: def2/J RIJCOSX GRIDX6 NOFINALGRIDX
keywords: grid4 nofinalgrid
keywords: scfconv7
keywords: smallprint printgap noloewdin
keywords: NOSOSCF
formula: C18H23N3O4
InChI: InChI=1/C18H23N3O4/c1-3-5-6-11-25-17(22)16(4-2)21(13-15-8-7-12-24-15)18(23)20-10-9-19-14-20/h3,7-10,12,14,16H,1,4-6,11,13H2,2H3
48 atoms
O  -0.143021 -1.630871 0.152442
O  -2.883037 -0.619072 -0.962377
O  -1.044793 -1.54616 2.197965
O  -0.358598 2.928681 -1.187269
N  -0.519383 1.150241 0.206503
N  1.527586 1.721229 -0.811283
N  3.38698 0.65951 -1.339428
C  0.074168 0.401593 1.307613
C  -0.131798 1.073936 2.662817
C  -1.976385 1.30219 0.20701
C  -0.447487 -1.033173 1.293114
C  0.151503 1.995556 -0.619545
C  0.428334 2.488141 2.697483
C  -2.612156 0.704507 -0.99459
C  -0.540989 -2.988779 -0.04034
C  0.263727 -3.991626 0.769187
C  -2.981518 1.220871 -2.190801
C  1.781546 -3.787656 0.728572
C  2.494281 2.686075 -0.982581
C  2.129812 0.517552 -1.060544
C  -3.515105 0.136189 -2.946948
C  -3.426837 -0.950712 -2.147651
C  3.630132 2.0059 -1.285011
C  2.283134 -2.745761 1.681093
C  3.135936 -1.772125 1.387326
H  1.150934 0.334381 1.141506
H  -1.186592 1.077337 2.944542
H  0.368602 0.45948 3.413789
H  -2.245417 2.35655 0.270295
H  -2.367017 0.823059 1.105621
H  1.478808 2.513531 2.401366
H  -0.117604 3.165111 2.039454
H  0.363705 2.899531 3.704129
H  -0.384778 -3.155263 -1.106215
H  -1.608005 -3.096363 0.165638
H  0.020679 -4.974436 0.355799
H  -0.080921 -4.007875 1.804562
H  -2.871067 2.247389 -2.496993
H  2.119819 -3.567885 -0.288215
H  2.250283 -4.738452 1.002184
H  2.281562 3.734595 -0.871921
H  1.583981 -0.411975 -1.041707
H  -3.910707 0.165329 -3.948215
H  -3.70835 -1.982393 -2.278072
H  4.61218 2.410193 -1.469849
H  1.929306 -2.842026 2.704923
H  3.486261 -1.08552 2.146992
H  3.530832 -1.622259 0.38991
totalener: -1164.99689319 hartree
nucrepener: 2396.67689558 hartree
electener: -3561.67378877 hartree
oneelecener: -6349.85751293 hartree
twoeener: 2788.18372415 hartree
kineticenergy: 1160.08598010 hartree
xcener: -111.464625352498 hartree
chargesum: -0.0000000
charge: -0.248515 -0.262582 -0.332659 -0.366139 -0.098570 -0.018916 -0.316968 -0.045831 -0.088680 -0.067932 0.325307 0.305782 -0.268516 0.155325 -0.037749 -0.127402 -0.229647 -0.096634 -0.126780 0.020436 -0.148636 -0.022986 -0.070871 -0.108545 -0.296942 0.099615 0.074057 0.084238 0.135626 0.125786 0.083348 0.083154 0.102361 0.103688 0.109598 0.083347 0.094620 0.151521 0.074828 0.091222 0.155912 0.168462 0.139224 0.141667 0.130539 0.117872 0.112551 0.111413
qa: -0.2485 -0.2626 -0.3327 -0.3661 -0.0986 -0.0189 -0.3170 -0.0458 -0.0887 -0.0679 0.3253 0.3058 -0.2685 0.1553 -0.0377 -0.1274 -0.2296 -0.0966 -0.1268 0.0204 -0.1486 -0.0230 -0.0709 -0.1085 -0.2969 0.0996 0.0741 0.0842 0.1356 0.1258 0.0833 0.0832 0.1024 0.1037 0.1096 0.0833 0.0946 0.1515 0.0748 0.0912 0.1559 0.1685 0.1392 0.1417 0.1305 0.1179 0.1126 0.1114
va: 2.0956 2.2907 2.1699 2.1385 2.9888 3.2758 3.0862 3.9944 3.8877 3.8692 4.2178 4.2967 3.9396 3.5354 3.8835 3.8426 4.0285 3.8770 3.9189 3.9622 3.9720 3.9193 4.0178 3.7436 3.9510 1.0082 1.0185 1.0196 1.0087 1.0193 1.0029 1.0068 1.0076 0.9935 1.0130 1.0110 1.0181 1.0145 1.0148 1.0057 1.0095 1.0105 1.0045 1.0014 1.0064 1.0076 1.0076 1.0235
dispcorr: -0.030359259 hartree
energy: -1165.027252449405
dipole: 5.84382 -6.45922 -0.61540 -8.29837 7.75071 -0.54767 11.72523 -11.29850 0.42674
magnitude: 0.92777 au
magnitude: 2.35821 debye
