program: Orca
programVersion: 4.2.1
elementType: O O O O N N N C C C C C C C C C C C C C C C C C C H H H H H H H H H H H H H H H H H H H H H H H
charge: 0
multiplicity: 1
keywords: wb97x-d3
keywords: def2-TZVPP
keywords: def2/J RIJCOSX GRIDX6 NOFINALGRIDX
keywords: grid4 nofinalgrid
keywords: scfconv7
keywords: smallprint printgap noloewdin
keywords: NOSOSCF
formula: C18H23N3O4
InChI: InChI=1/C18H23N3O4/c1-3-5-6-11-25-17(22)16(4-2)21(13-15-8-7-12-24-15)18(23)20-10-9-19-14-20/h3,7-10,12,14,16H,1,4-6,11,13H2,2H3
48 atoms
O  0.253156 -1.7733 0.43563
O  -2.601247 0.244215 -1.631241
O  0.198793 -0.817571 -1.58076
O  -0.355843 3.891073 -0.553323
N  -0.269762 1.643174 -0.215116
N  1.532237 2.81004 -1.181915
N  3.515555 3.603749 -1.731501
C  0.554414 0.581944 0.346343
C  0.472883 0.51567 1.874985
C  -1.688872 1.629095 0.133798
C  0.291083 -0.737296 -0.386917
C  0.234991 2.843205 -0.626846
C  0.823964 1.845337 2.527422
C  -2.369183 0.389524 -0.312797
C  0.013782 -3.066092 -0.12933
C  -0.301013 -4.018354 1.002515
C  -2.826819 -0.697768 0.356762
C  0.826783 -4.179772 2.022408
C  2.103499 1.88071 -2.029827
C  2.432662 3.834062 -1.06221
C  -3.366609 -1.57617 -0.628062
C  -3.191219 -0.945929 -1.813316
C  3.318501 2.39654 -2.348206
C  0.495523 -5.207626 3.05673
C  0.361992 -4.966185 4.3536
H  1.595399 0.817261 0.108006
H  -0.509968 0.175117 2.207112
H  1.177187 -0.245022 2.213982
H  -2.152888 2.501947 -0.322412
H  -1.830339 1.736192 1.212731
H  0.853826 1.742128 3.611571
H  1.806286 2.198652 2.208103
H  0.103587 2.631217 2.298443
H  0.899723 -3.389027 -0.684143
H  -0.819296 -3.011245 -0.832276
H  -0.529505 -4.989063 0.552209
H  -1.214474 -3.696667 1.509687
H  -2.782178 -0.856985 1.421883
H  1.037538 -3.223804 2.505775
H  1.742169 -4.474609 1.496976
H  1.584606 0.992783 -2.348042
H  2.226021 4.705053 -0.460699
H  -3.825904 -2.537833 -0.471778
H  -3.435477 -1.213311 -2.827835
H  4.062715 1.968766 -3.00058
H  0.34068 -6.219903 2.692309
H  0.109827 -5.749362 5.055296
H  0.502529 -3.973903 4.764957
totalener: -1164.99792349 hartree
nucrepener: 2320.96945298 hartree
electener: -3485.96737647 hartree
oneelecener: -6197.89832269 hartree
twoeener: 2711.93094623 hartree
kineticenergy: 1160.07897631 hartree
xcener: -111.464448316026 hartree
chargesum: -0.0000000
charge: -0.256588 -0.237135 -0.362729 -0.365303 -0.095540 -0.038902 -0.299839 -0.007568 -0.107303 -0.136323 0.325192 0.322925 -0.267593 0.203793 -0.041058 -0.112126 -0.207497 -0.031122 -0.190125 0.053705 -0.214614 0.026262 -0.075165 -0.178754 -0.211507 0.118420 0.073917 0.076458 0.129911 0.123498 0.102035 0.086657 0.083988 0.113791 0.119054 0.073010 0.075017 0.133257 0.062375 0.074161 0.205529 0.144664 0.145076 0.142036 0.131243 0.106454 0.103926 0.080440
qa: -0.2566 -0.2371 -0.3627 -0.3653 -0.0955 -0.0389 -0.2998 -0.0076 -0.1073 -0.1363 0.3252 0.3229 -0.2676 0.2038 -0.0411 -0.1121 -0.2075 -0.0311 -0.1901 0.0537 -0.2146 0.0263 -0.0752 -0.1788 -0.2115 0.1184 0.0739 0.0765 0.1299 0.1235 0.1020 0.0867 0.0840 0.1138 0.1191 0.0730 0.0750 0.1333 0.0624 0.0742 0.2055 0.1447 0.1451 0.1420 0.1312 0.1065 0.1039 0.0804
va: 2.1356 2.3326 2.1170 2.1351 3.0259 3.2719 3.1368 3.9562 3.8914 3.9312 4.1776 4.2794 3.9430 3.5032 3.8592 3.8834 3.9166 3.8477 3.8836 4.0395 3.9443 3.9110 4.0629 3.8687 3.9744 0.9951 1.0106 1.0195 1.0315 0.9962 1.0064 1.0046 1.0117 1.0049 1.0095 1.0196 1.0205 1.0104 1.0260 1.0107 1.0072 1.0087 1.0030 1.0006 1.0093 1.0076 1.0089 1.0165
dispcorr: -0.027747327 hartree
energy: -1165.025670817169
dipole: 0.49617 -1.42254 -0.92636 -22.51644 20.17370 -2.34274 21.29570 -19.99421 1.30149
magnitude: 2.83557 au
magnitude: 7.20744 debye
