program: Orca
programVersion: 4.2.1
elementType: Cl O O N N N C C C C C C C C C C C C C C C C C C C H H H H H H H H H H H H H H H H H H H H H H H H
charge: 0
multiplicity: 1
keywords: wb97x-d3
keywords: def2-TZVPP
keywords: def2/J RIJCOSX GRIDX6 NOFINALGRIDX
keywords: grid4 nofinalgrid
keywords: scfconv7
keywords: smallprint printgap noloewdin
keywords: NOSOSCF
formula: C19H24ClN3O2
InChI: InChI=1/C19H24ClN3O2/c1-18(2)13-25-19(3,23(18)17(24)22-12-11-21-14-22)10-4-5-15-6-8-16(20)9-7-15/h6-9,11-12,14H,4-5,10,13H2,1-3H3
49 atoms
Cl -5.654357 2.133194 -2.48588
O  2.894995 1.516148 0.617278
O  1.709372 -2.243636 -1.400701
N  2.537744 -0.597516 -0.076089
N  1.318543 -2.395898 0.826304
N  -0.22711 -3.363882 2.060236
C  2.508711 0.268872 1.146384
C  3.212154 0.110063 -1.194119
C  3.821209 1.273057 -0.416077
C  1.127625 0.451538 1.769176
C  3.523714 -0.173101 2.196272
C  4.302976 -0.720381 -1.85173
C  2.214817 0.640201 -2.22237
C  0.011099 0.83422 0.80951
C  1.873599 -1.73159 -0.310881
C  -1.334413 0.933702 1.530522
C  -2.447056 1.239024 0.570211
C  1.982879 -3.036228 1.843541
C  -0.006213 -2.644886 0.997407
C  -2.656966 2.537931 0.11221
C  -3.255495 0.225382 0.064431
C  1.009435 -3.621869 2.591294
C  -3.638875 2.822594 -0.824207
C  -4.24468 0.488746 -0.872525
C  -4.425268 1.789893 -1.311167
H  4.811971 1.01802 -0.020462
H  3.919762 2.172515 -1.022737
H  1.238955 1.237794 2.521818
H  0.856374 -0.44075 2.33496
H  4.49576 -0.40238 1.760233
H  3.18905 -1.047944 2.746781
H  3.655471 0.630537 2.921283
H  4.96009 -1.174831 -1.109607
H  4.914241 -0.068789 -2.478281
H  3.904069 -1.505518 -2.48961
H  1.469588 1.288935 -1.761149
H  2.749986 1.229249 -2.968362
H  1.696652 -0.159833 -2.744783
H  0.235408 1.790545 0.331885
H  -0.08499 0.108569 -0.003383
H  -1.27797 1.707716 2.300028
H  -1.540825 -0.007299 2.048354
H  3.056417 -3.0586 1.913635
H  -0.755627 -2.271123 0.316987
H  -2.045027 3.347897 0.490721
H  -3.119624 -0.793763 0.406616
H  1.136092 -4.223244 3.476834
H  -3.786621 3.837499 -1.167365
H  -4.8629 -0.313367 -1.251979
elementType: Cl O N C H
totalener: -1513.51241976 hartree
nucrepener: 2427.05936080 hartree
electener: -3940.57178055 hartree
oneelecener: -6891.09276827 hartree
twoeener: 2950.52098772 hartree
cpcmener: -0.03670480 hartree
kineticenergy: 1508.16537866 hartree
xcener: -124.308905691172 hartree
chargesum: -0.0000000
charge: -0.107369 -0.385659 -0.474923 -0.042953 -0.010489 -0.379733 0.227582 0.134735 0.073977 -0.151960 -0.310954 -0.323957 -0.357631 -0.194992 0.338104 -0.070356 0.044969 -0.153879 0.029567 -0.219265 -0.212896 -0.124121 -0.152733 -0.159876 0.090132 0.085919 0.114306 0.112678 0.088884 0.111719 0.116303 0.112830 0.101416 0.114554 0.106847 0.112787 0.112242 0.111481 0.099405 0.083691 0.105392 0.089446 0.197299 0.168408 0.146063 0.144159 0.168349 0.145522 0.144983
qa: -0.1074 -0.3857 -0.4749 -0.0430 -0.0105 -0.3797 0.2276 0.1347 0.0740 -0.1520 -0.3110 -0.3240 -0.3576 -0.1950 0.3381 -0.0704 0.0450 -0.1539 0.0296 -0.2193 -0.2129 -0.1241 -0.1527 -0.1599 0.0901 0.0859 0.1143 0.1127 0.0889 0.1117 0.1163 0.1128 0.1014 0.1146 0.1068 0.1128 0.1122 0.1115 0.0994 0.0837 0.1054 0.0894 0.1973 0.1684 0.1461 0.1442 0.1683 0.1455 0.1450
va: 1.1979 1.9617 2.0263 3.1461 3.2469 3.0881 4.0935 3.9048 3.8915 3.7151 3.9503 3.9188 3.9250 3.8839 4.2577 3.7682 3.5403 3.9112 4.0243 3.9843 3.9777 4.0359 3.9758 4.0077 3.8154 1.0039 0.9933 1.0233 1.0117 1.0038 1.0002 1.0101 1.0041 0.9991 1.0147 0.9980 1.0030 1.0186 1.0317 1.0068 1.0091 1.0152 0.9779 1.0007 1.0017 1.0004 1.0015 1.0045 1.0056
dispcorr: -0.029977825 hartree
energy: -1513.542397580277
dipole: 34.94249 -31.87184 3.07064 -0.07698 1.65352 1.57653 9.43557 -8.51031 0.92525
magnitude: 3.57357 au
magnitude: 9.08329 debye
