program: Gaussian 09
title: 000073685
version: EM64L-G09RevD.01
frameworkgroup: C1[X(C20H12O7)]
method: RPBEPBE
basis: SDD
operation: Freq
keyword: #pfreq=noraman
keyword: PBEPBE/SDD
title: #p freq=noraman PBEPBE/SDD
converged: YES YES NO NO
title: Mulliken charges:
elementType: O O O O O O O C C C C C C C C C C C C C C C C C C C C H H H H H H H H H H H H
charge: -0.223332 -0.298113 -0.211582 -0.471377 -0.417955 -0.421904 -0.480113 -0.089282 0.293817 0.475676 0.418891 0.085558 0.030977 0.046436 0.098339 -0.376294 -0.368364 -0.394853 -0.017516 0.017282 -0.377521 -0.364408 -0.383185 -0.214855 0.144413 0.168800 -0.222963 0.249113 0.251563 0.258668 0.271135 0.255124 0.229462 0.235175 0.237303 0.406232 0.392283 0.386895 0.380473
chargesum: 0.00000
title: Mulliken charges with hydrogens summed into heavy atoms:
elementType: O O O O O O O C C C C C C C C C C C C C C C C C C C C
charge: -0.223332 -0.298113 -0.211582 -0.065145 -0.025672 -0.035009 -0.099640 -0.089282 0.293817 0.475676 0.418891 0.085558 0.030977 0.046436 0.098339 -0.127181 -0.116801 -0.136184 -0.017516 0.017282 -0.106386 -0.109284 -0.153722 0.020321 0.144413 0.168800 0.014340
polarizability: 3.07314934e+02 1.49812880e+00 2.75101461e+02 -2.91265987e+00 -7.37811514e-01 1.60614159e+02
1716.lowfreq: -9.8050 -1.9469 0.0003 0.0005 0.0010 3.5097 23.3104 43.9827 50.1488
frequency: 23.1348 43.9812 50.1414 54.7068 85.2392 121.1362 132.9870 136.7775 168.8151 187.5408 211.7569 234.3746 242.5265 261.1959 264.9633 271.9592 283.8280 287.9423 299.4322 316.8247 321.1098 357.4550 373.5606 417.1003 445.4201 452.8035 466.2842 477.3009 482.0797 496.9094 502.9900 537.4260 540.5364 543.9741 553.3452 569.7686 592.3735 603.3981 604.1873 620.1464 654.0367 664.7913 687.4512 706.9707 713.8843 727.4994 738.5181 756.3110 767.6233 774.9530 785.8317 794.0026 815.9280 836.4462 856.1680 894.4707 920.3157 922.4318 941.1922 968.3654 988.0862 996.7148 1002.9184 1018.6924 1033.6495 1051.0833 1100.3155 1129.2915 1145.5321 1159.3482 1170.1153 1173.6166 1194.4936 1201.6206 1221.5119 1229.9913 1244.0937 1254.9791 1263.3153 1275.8171 1279.5792 1302.7322 1361.5402 1399.4606 1413.9214 1428.6055 1448.6945 1453.9511 1460.5447 1476.5636 1502.8838 1513.4082 1596.6824 1604.5676 1615.8333 1620.8815 1630.1983 1648.3192 1684.0259 3134.7166 3134.7836 3146.6239 3151.6589 3157.5606 3164.3324 3170.9129 3181.3587 3522.4570 3527.4674 3552.4015 3627.5389
redmass: 5.9331 7.3314 5.9054 7.7615 5.9242 7.1076 5.1976 8.1752 7.0415 8.1306 9.0533 6.8289 6.2482 5.3959 1.3548 5.7935 4.8460 3.9168 7.2564 6.3143 7.4259 6.4777 5.9126 3.3900 1.2248 4.5195 6.4361 1.1124 1.1382 8.1473 4.4868 4.5297 4.7678 6.1290 8.9349 7.2183 8.4280 5.0070 4.8934 5.2525 5.7259 4.8542 7.2319 7.6526 7.1187 7.1675 7.8780 3.3089 2.5282 5.6801 1.6934 2.0046 1.8766 5.3837 6.3064 1.4568 1.5895 3.2228 1.3453 1.4410 4.2235 6.0373 1.3337 2.9437 3.0011 3.4464 1.9063 1.3974 1.4770 1.8297 1.1484 1.4305 2.6718 1.7737 2.8137 2.8743 2.6816 3.1553 1.8813 1.6366 2.3151 2.9206 1.9685 8.7524 8.9448 6.7316 2.5070 4.6709 2.7027 3.5399 4.0414 3.9628 7.9009 7.5888 7.3394 7.9816 7.3640 8.0738 12.9865 1.0869 1.0881 1.0901 1.0891 1.0955 1.0955 1.1004 1.0958 1.0649 1.0652 1.0657 1.0668
irintensity: 0.5284 1.7181 0.9338 2.2700 1.0244 0.7012 1.0140 0.2640 0.5280 1.3078 3.9536 4.4358 4.0361 6.1184 124.7509 14.8852 9.3359 29.9698 10.0636 0.3684 0.9088 7.4477 2.2874 0.5800 134.7653 15.7854 12.3121 163.5522 131.9300 19.4540 11.8396 3.6586 1.1155 12.8353 3.2093 14.0154 3.3924 4.3060 9.9966 22.6865 7.3911 20.3725 3.3108 18.7827 42.5557 19.4673 1.3370 21.0510 63.6834 112.0719 36.9673 48.9207 49.5047 0.2195 7.3987 1.5951 7.3705 41.8149 4.4857 1.1043 86.5329 165.3369 0.0451 29.3756 316.7037 13.4992 35.9810 47.2150 11.6881 349.2132 9.1187 44.7982 69.1676 24.3149 191.4236 40.0362 359.5553 37.8572 16.8684 50.0909 124.9128 162.6511 33.7817 4.1276 43.1774 6.7057 38.1640 161.1709 15.4813 48.8750 63.2380 62.7223 15.9868 3.8985 14.1027 48.5398 173.5172 7.4666 390.0395 3.1019 6.7033 6.6494 3.1907 9.0766 4.8741 22.5177 3.7826 101.6579 105.2031 84.5136 90.9770
temp: 298.150 k
press: 1.00000 atm
elementType: 8 8 8 8 8 8 8 6 6 6 6 6 6 6 6 6 6 6 6 6 6 6 6 6 6 6 6 1 1 1 1 1 1 1 1 1 1 1 1
symmnumber: 1
zpe: 719757.3 jmol-1
zpe.correction: 0.274141 hartree
zpe.thermalcorrener: 0.295896 hartree
zpe.thermalcorrenthalpy: 0.296840 hartree
zpe.thermalcorrgfe: 0.223989 hartree
zpe.sumelectzpe: -1294.039110 hartree
zpe.sumelectthermal: -1294.017355 hartree
zpe.sumelectthermalent: -1294.016411 hartree
zpe.sumelectthermalfe: -1294.089262 hartree
dipole: 0.0145 -5.3081 -5.7552
dipole: 7.8293
quadrupole: -138.4511 -130.9021 -166.8796
quadrupole: -7.2672 15.8510 1.8880
quadrupole: 6.9598 14.5088 -21.4686 -7.2672 15.8510 1.8880
hfenergy: -1294.3132508 hartree
pointgroup: C01 [X(C20H12O7)]
dipole: 0.0618571 -2.1131715 -2.2402924 debye
polarizability: 307.3687338|1.1898321|275.0436309|2.2051545|-1.9285105|160.6181894 unknown
InChI: InChI=1S/C20H12O7/c21-13-7-5-11-17(15(13)23)26-18-12(6-8-14(22)16(18)24)20(11)10-4-2-1-3-9(10)19(25)27-20/h1-8,21-24H
charge 0 multiplicity 1
39 atoms
O  -1.125035 -0.003251 1.75073
O  2.36208 -0.000404 0.233046
O  -3.201253 -0.02439 2.826349
O  3.836168 2.300257 0.075847
O  3.824702 -2.286477 0.124132
O  2.611565 4.767312 -0.142825
O  2.670688 -4.719791 -0.050066
C  -0.60228 0.004348 0.274316
C  -1.909195 -0.002241 -0.516385
C  0.218646 1.263939 0.099624
C  0.230782 -1.25787 0.112867
C  -3.015116 -0.009572 0.355419
C  1.62685 1.197605 0.133848
C  1.647146 -1.203873 0.149097
C  -2.543357 -0.013123 1.769134
C  -0.369972 2.550241 -0.021933
C  -0.387102 -2.528763 0.011523
C  -2.096834 0.005651 -1.91026
C  2.433868 2.347499 0.052505
C  2.433425 -2.375939 0.09257
C  -4.340926 -0.010775 -0.122946
C  0.417013 3.713999 -0.102291
C  0.373039 -3.7118 -0.045625
C  -3.423688 0.003934 -2.404831
C  1.827085 3.616993 -0.06215
C  1.779987 -3.625964 0.00008
C  -4.537013 -0.004444 -1.522102
H  -1.460519 2.638285 -0.042018
H  -1.479012 -2.589642 -0.008635
H  -1.242239 0.016298 -2.59462
H  -5.179949 -0.014698 0.580327
H  -0.0363 4.704772 -0.189288
H  -0.123179 -4.686374 -0.117379
H  -3.5962 0.011515 -3.486749
H  -5.55214 -0.003725 -1.933198
H  4.143889 1.360522 0.157176
H  4.197583 -3.207293 0.089132
H  3.570861 4.51307 -0.092704
H  2.198034 -5.585133 -0.078117
