program: Orca
programVersion: 4.2.1
elementType: Cl O O N N N C C C C C C C C C C C C C C C C C C C H H H H H H H H H H H H H H H H H H H H H H H H
charge: 0
multiplicity: 1
keywords: wb97x-d3
keywords: def2-TZVPP
keywords: def2/J RIJCOSX GRIDX6 NOFINALGRIDX
keywords: grid4 nofinalgrid
keywords: scfconv7
keywords: smallprint printgap noloewdin
keywords: NOSOSCF
formula: C19H24ClN3O2
InChI: InChI=1/C19H24ClN3O2/c1-18(2)13-25-19(3,23(18)17(24)22-12-11-21-14-22)10-4-5-15-6-8-16(20)9-7-15/h6-9,11-12,14H,4-5,10,13H2,1-3H3
49 atoms
Cl -5.429378 3.340639 1.521603
O  1.975093 1.432087 0.572845
O  3.296156 -2.216345 -1.569336
N  2.627924 -0.611162 -0.111563
N  1.535354 -2.690505 -0.222396
N  -0.195755 -4.045035 -0.344741
C  1.603503 0.082576 0.733204
C  3.720296 0.326653 -0.474048
C  3.379414 1.477536 0.469159
C  0.164398 -0.050695 0.244204
C  1.708314 -0.30399 2.205576
C  5.102923 -0.225271 -0.164007
C  3.616034 0.793877 -1.924142
C  -0.076401 0.283132 -1.220883
C  2.559926 -1.811264 -0.691614
C  -1.524896 0.019948 -1.641124
C  -2.519955 0.836883 -0.866067
C  1.459527 -3.328712 0.991387
C  0.525857 -3.175006 -0.991665
C  -2.647913 2.204907 -1.099704
C  -3.311499 0.26397 0.124434
C  0.383994 -4.155221 0.89177
C  -3.536845 2.981201 -0.372837
C  -4.20804 1.023066 0.863963
C  -4.311685 2.379568 0.607152
H  3.862183 1.353083 1.446393
H  3.674302 2.446008 0.066318
H  -0.42263 0.624692 0.873135
H  -0.213074 -1.047546 0.477816
H  1.148021 0.417692 2.800652
H  2.738929 -0.312641 2.559901
H  1.278357 -1.282386 2.402011
H  5.827925 0.589046 -0.20831
H  5.419569 -0.982507 -0.877126
H  5.145592 -0.6509 0.839126
H  4.384382 1.544647 -2.113687
H  3.768695 -0.018247 -2.630232
H  2.647898 1.251753 -2.130399
H  0.174596 1.328668 -1.413441
H  0.571277 -0.307313 -1.874225
H  -1.750385 -1.043029 -1.51952
H  -1.622054 0.237337 -2.707111
H  2.183324 -3.178931 1.773505
H  0.368739 -2.850167 -2.008277
H  -2.046724 2.679497 -1.866168
H  -3.234603 -0.797088 0.328357
H  0.004817 -4.829286 1.642686
H  -3.624384 4.04054 -0.57223
H  -4.815162 0.557067 1.628063
elementType: Cl O N C H
totalener: -1513.51202540 hartree
nucrepener: 2433.47065736 hartree
electener: -3946.98268276 hartree
oneelecener: -6903.82598683 hartree
twoeener: 2956.84330407 hartree
cpcmener: -0.03654851 hartree
kineticenergy: 1508.16515202 hartree
xcener: -124.310001278838 hartree
chargesum: -0.0000000
charge: -0.107614 -0.385862 -0.475962 -0.037551 -0.010883 -0.378476 0.215360 0.136164 0.073069 -0.153822 -0.312273 -0.322238 -0.359268 -0.159451 0.337795 -0.113915 0.022134 -0.154919 0.023053 -0.204857 -0.185992 -0.124706 -0.155216 -0.148765 0.091614 0.085291 0.114851 0.108672 0.090255 0.113081 0.110779 0.116509 0.114880 0.105888 0.101567 0.112122 0.112158 0.112076 0.094289 0.088744 0.092644 0.108036 0.196384 0.175671 0.143985 0.135902 0.168428 0.145018 0.145349
qa: -0.1076 -0.3859 -0.4760 -0.0376 -0.0109 -0.3785 0.2154 0.1362 0.0731 -0.1538 -0.3123 -0.3222 -0.3593 -0.1595 0.3378 -0.1139 0.0221 -0.1549 0.0231 -0.2049 -0.1860 -0.1247 -0.1552 -0.1488 0.0916 0.0853 0.1149 0.1087 0.0903 0.1131 0.1108 0.1165 0.1149 0.1059 0.1016 0.1121 0.1122 0.1121 0.0943 0.0887 0.0926 0.1080 0.1964 0.1757 0.1440 0.1359 0.1684 0.1450 0.1453
va: 1.1975 1.9608 2.0261 3.1386 3.2397 3.0926 4.1463 3.9012 3.8930 3.6864 3.9502 3.9191 3.9286 3.8806 4.2666 3.8370 3.5528 3.9082 4.0301 3.9781 3.9324 4.0317 3.9822 3.9874 3.8100 1.0041 0.9931 1.0249 1.0075 1.0097 1.0042 1.0012 0.9994 1.0153 1.0039 1.0026 1.0176 0.9982 1.0224 1.0139 1.0152 1.0047 0.9792 0.9961 1.0024 1.0070 1.0015 1.0043 1.0040
dispcorr: -0.030309921 hartree
energy: -1513.542335318380
dipole: 31.39004 -29.52489 1.86515 -4.64759 6.13954 1.49195 -4.81106 5.72939 0.91833
magnitude: 2.55891 au
magnitude: 6.50423 debye
