program: Orca
programVersion: 4.2.1
elementType: Cl O O N N N C C C C C C C C C C C C C C C C C C C H H H H H H H H H H H H H H H H H H H H H H H H
charge: 0
multiplicity: 1
keywords: wb97x-d3
keywords: def2-TZVPP
keywords: def2/J RIJCOSX GRIDX6 NOFINALGRIDX
keywords: grid4 nofinalgrid
keywords: scfconv7
keywords: smallprint printgap noloewdin
keywords: NOSOSCF
formula: C19H24ClN3O2
InChI: InChI=1/C19H24ClN3O2/c1-18(2)13-25-19(3,23(18)17(24)22-12-11-21-14-22)10-4-5-15-6-8-16(20)9-7-15/h6-9,11-12,14H,4-5,10,13H2,1-3H3
49 atoms
Cl -5.406101 3.232026 1.867317
O  1.900194 1.248989 0.88874
O  3.315027 -1.935313 -1.845981
N  2.599966 -0.634378 -0.127459
N  1.542706 -2.667192 -0.631212
N  0.515636 -4.359989 0.330741
C  1.533646 -0.106611 0.785381
C  3.694616 0.357164 -0.27037
C  3.306853 1.312254 0.855341
C  0.11716 -0.151346 0.218502
C  1.576026 -0.753895 2.168169
C  5.070963 -0.237213 -0.015299
C  3.640037 1.082555 -1.613367
C  -0.067557 0.446187 -1.16861
C  2.559745 -1.706112 -0.922392
C  -1.50842 0.303135 -1.669584
C  -2.505529 1.023242 -0.805831
C  0.550085 -3.058558 -1.497038
C  1.484299 -3.496685 0.443122
C  -3.316351 0.335798 0.09244
C  -2.615593 2.411444 -0.85997
C  -0.082791 -4.086039 -0.871176
C  -4.210622 1.003752 0.917609
C  -3.50235 3.097944 -0.045209
C  -4.293676 2.38377 0.841522
H  3.747039 1.005029 1.811261
H  3.612525 2.338212 0.656102
H  -0.502072 0.392888 0.937221
H  -0.257055 -1.176033 0.24082
H  2.591109 -0.864928 2.54845
H  1.105829 -1.734003 2.174786
H  1.017477 -0.129321 2.865454
H  5.790257 0.574937 0.099648
H  5.413727 -0.862976 -0.835952
H  5.088337 -0.825431 0.902888
H  4.403725 1.860871 -1.630865
H  3.832784 0.413651 -2.448547
H  2.673848 1.561903 -1.772423
H  0.212588 1.501847 -1.166176
H  0.586082 -0.040088 -1.897436
H  -1.768195 -0.757221 -1.724765
H  -1.560738 0.690763 -2.689259
H  0.376918 -2.572448 -2.442472
H  2.20304 -3.452277 1.245415
H  -3.255623 -0.743915 0.15471
H  -2.001349 2.973901 -1.553033
H  -0.93604 -4.643187 -1.222598
H  -4.832199 0.45007 1.60805
H  -3.575709 4.175312 -0.104877
elementType: Cl O N C H
totalener: -1513.51206258 hartree
nucrepener: 2430.22125416 hartree
electener: -3943.73331674 hartree
oneelecener: -6897.18160939 hartree
twoeener: 2953.44829265 hartree
cpcmener: -0.03648268 hartree
kineticenergy: 1508.16234370 hartree
xcener: -124.309263308976 hartree
chargesum: 0.0000000
charge: -0.107801 -0.383605 -0.476751 -0.035863 -0.013927 -0.380563 0.210639 0.129589 0.073283 -0.155575 -0.320144 -0.321984 -0.356761 -0.155084 0.342542 -0.108241 0.027447 -0.156181 0.024368 -0.199110 -0.209462 -0.121431 -0.139668 -0.152782 0.086863 0.085282 0.114318 0.109154 0.096582 0.111164 0.117579 0.114930 0.116061 0.106260 0.101079 0.111677 0.111555 0.112293 0.093578 0.088470 0.092592 0.106277 0.184451 0.185442 0.139070 0.143717 0.169273 0.145085 0.144314
qa: -0.1078 -0.3836 -0.4768 -0.0359 -0.0139 -0.3806 0.2106 0.1296 0.0733 -0.1556 -0.3201 -0.3220 -0.3568 -0.1551 0.3425 -0.1082 0.0274 -0.1562 0.0244 -0.1991 -0.2095 -0.1214 -0.1397 -0.1528 0.0869 0.0853 0.1143 0.1092 0.0966 0.1112 0.1176 0.1149 0.1161 0.1063 0.1011 0.1117 0.1116 0.1123 0.0936 0.0885 0.0926 0.1063 0.1845 0.1854 0.1391 0.1437 0.1693 0.1451 0.1443
va: 1.1976 1.9634 2.0246 3.1431 3.2453 3.0990 4.1574 3.9137 3.8959 3.6874 3.9505 3.9186 3.9261 3.8788 4.2619 3.8375 3.5493 3.9161 4.0405 3.9356 3.9851 4.0218 3.9800 3.9794 3.8157 1.0037 0.9937 1.0255 1.0021 1.0041 0.9984 1.0103 0.9989 1.0149 1.0044 1.0028 1.0185 0.9981 1.0230 1.0137 1.0133 1.0054 0.9899 0.9863 1.0051 1.0026 1.0004 1.0040 1.0045
dispcorr: -0.030221393 hartree
energy: -1513.542283974419
dipole: 29.93939 -28.72268 1.21670 -4.16510 5.73090 1.56580 -6.47927 6.60064 0.12137
magnitude: 1.98667 au
magnitude: 5.04970 debye
