program: Orca
programVersion: 4.2.1
elementType: Cl O O N N N C C C C C C C C C C C C C C C C C C C H H H H H H H H H H H H H H H H H H H H H H H H
charge: 0
multiplicity: 1
keywords: wb97x-d3
keywords: def2-TZVPP
keywords: def2/J RIJCOSX GRIDX6 NOFINALGRIDX
keywords: grid4 nofinalgrid
keywords: scfconv7
keywords: smallprint printgap noloewdin
keywords: NOSOSCF
formula: C19H24ClN3O2
InChI: InChI=1/C19H24ClN3O2/c1-18(2)13-25-19(3,23(18)17(24)22-12-11-21-14-22)10-4-5-15-6-8-16(20)9-7-15/h6-9,11-12,14H,4-5,10,13H2,1-3H3
49 atoms
Cl -6.087721 1.94661 -2.009817
O  2.949405 1.539939 -0.255422
O  1.546798 -1.304409 2.397115
N  2.317158 -0.535244 0.406932
N  1.75673 -2.797018 0.700762
N  0.765915 -4.659167 0.07364
C  2.549388 0.847907 0.908755
C  2.614629 -0.628502 -1.044818
C  2.49576 0.851616 -1.397297
C  1.300109 1.497319 1.51621
C  3.708813 0.898591 1.891425
C  4.037799 -1.114703 -1.301808
C  1.607227 -1.418829 -1.867345
C  0.027938 1.447666 0.681118
C  1.871407 -1.477028 1.239014
C  -1.171161 1.986467 1.464388
C  -2.419738 1.991112 0.630872
C  2.758854 -3.707698 0.475991
C  0.58088 -3.427504 0.455758
C  -2.804428 3.125592 -0.078238
C  -3.194977 0.841143 0.501936
C  2.122342 -4.846322 0.088474
C  -3.928583 3.122829 -0.89133
C  -4.321644 0.816519 -0.306158
C  -4.678633 1.963072 -0.998156
H  3.12497 1.12143 -2.245395
H  1.461925 1.11172 -1.648644
H  1.563706 2.542857 1.701108
H  1.110203 1.058202 2.49493
H  3.931922 1.935804 2.142999
H  4.606132 0.451722 1.46374
H  3.472817 0.379987 2.817557
H  4.255643 -1.055859 -2.368618
H  4.177088 -2.151245 -1.003474
H  4.776616 -0.507646 -0.778511
H  0.579549 -1.205726 -1.571342
H  1.711071 -1.115734 -2.91047
H  1.773151 -2.493704 -1.838253
H  0.142093 2.038388 -0.230541
H  -0.19447 0.423754 0.364465
H  -0.952273 2.999541 1.8106
H  -1.321116 1.374659 2.357581
H  3.797616 -3.486077 0.649399
H  -0.371924 -2.932262 0.562999
H  -2.2209 4.034562 0.004045
H  -2.922265 -0.056295 1.044523
H  2.571108 -5.791549 -0.170898
H  -4.21263 4.016036 -1.430873
H  -4.912047 -0.085618 -0.390578
elementType: Cl O N C H
totalener: -1513.51070451 hartree
nucrepener: 2391.17695895 hartree
electener: -3904.68766345 hartree
oneelecener: -6819.05323291 hartree
twoeener: 2914.36556946 hartree
cpcmener: -0.03683572 hartree
kineticenergy: 1508.17227039 hartree
xcener: -124.309891802218 hartree
chargesum: 0.0000000
charge: -0.108082 -0.399698 -0.472274 -0.066508 -0.016146 -0.379284 0.360950 0.130965 0.031715 -0.252639 -0.311790 -0.338087 -0.332237 -0.125118 0.331507 -0.060416 0.027111 -0.150623 0.043427 -0.212550 -0.223930 -0.131825 -0.148616 -0.149833 0.086820 0.117343 0.086647 0.101063 0.093234 0.114404 0.106960 0.103559 0.109686 0.114920 0.114170 0.107532 0.127038 0.105615 0.099805 0.069860 0.089355 0.095946 0.195960 0.169750 0.142139 0.144521 0.168460 0.145080 0.144112
qa: -0.1081 -0.3997 -0.4723 -0.0665 -0.0161 -0.3793 0.3609 0.1310 0.0317 -0.2526 -0.3118 -0.3381 -0.3322 -0.1251 0.3315 -0.0604 0.0271 -0.1506 0.0434 -0.2125 -0.2239 -0.1318 -0.1486 -0.1498 0.0868 0.1173 0.0866 0.1011 0.0932 0.1144 0.1070 0.1036 0.1097 0.1149 0.1142 0.1075 0.1270 0.1056 0.0998 0.0699 0.0894 0.0959 0.1960 0.1698 0.1421 0.1445 0.1685 0.1451 0.1441
va: 1.1972 1.9629 2.0261 3.1411 3.2360 3.1136 3.9416 3.8855 3.9504 3.8457 3.9506 3.9608 3.9420 3.8757 4.2786 3.7923 3.5777 3.9127 4.0403 3.9791 3.9727 4.0349 3.9677 3.9814 3.8135 0.9957 0.9889 1.0181 1.0327 1.0028 1.0041 1.0136 1.0019 1.0005 1.0038 0.9999 1.0039 0.9966 1.0104 1.0165 1.0122 1.0077 0.9779 1.0001 1.0035 1.0034 1.0020 1.0044 1.0050
dispcorr: -0.028729216 hartree
energy: -1513.539433721159
dipole: 33.31394 -31.13867 2.17527 -0.01602 1.49746 1.48144 3.27425 -4.21786 -0.94361
magnitude: 2.79586 au
magnitude: 7.10652 debye
