program: Orca
programVersion: 4.2.1
elementType: Cl O O N N N C C C C C C C C C C C C C C C C C C C H H H H H H H H H H H H H H H H H H H H H H H H
charge: 0
multiplicity: 1
keywords: wb97x-d3
keywords: def2-TZVPP
keywords: def2/J RIJCOSX GRIDX6 NOFINALGRIDX
keywords: grid4 nofinalgrid
keywords: scfconv7
keywords: smallprint printgap noloewdin
keywords: NOSOSCF
formula: C19H24ClN3O2
InChI: InChI=1/C19H24ClN3O2/c1-18(2)13-25-19(3,23(18)17(24)22-12-11-21-14-22)10-4-5-15-6-8-16(20)9-7-15/h6-9,11-12,14H,4-5,10,13H2,1-3H3
49 atoms
Cl -5.921095 1.725218 -2.131616
O  3.11387 1.524213 -0.139103
O  1.391203 -1.253383 2.388308
N  2.314096 -0.513528 0.452603
N  1.549986 -2.722869 0.665994
N  1.925975 -4.808036 0.073474
C  2.612188 0.843171 0.991241
C  2.652561 -0.596607 -0.992013
C  2.655922 0.895827 -1.313234
C  1.376653 1.56344 1.550359
C  3.723091 0.804549 2.028243
C  4.042687 -1.183513 -1.212749
C  1.617048 -1.286614 -1.867561
C  0.119778 1.534421 0.691258
C  1.751303 -1.429267 1.240887
C  -1.077015 2.153838 1.416084
C  -2.31624 2.075958 0.572199
C  0.322944 -3.270379 0.385692
C  2.475594 -3.696343 0.475425
C  -2.670208 3.113695 -0.285348
C  -3.105591 0.928154 0.576266
C  0.582612 -4.55011 0.00661
C  -3.775931 3.016772 -1.117983
C  -4.214383 0.810455 -0.248079
C  -4.538514 1.860451 -1.092575
H  3.336816 1.13477 -2.130511
H  1.654495 1.237206 -1.597183
H  1.680697 2.602073 1.710349
H  1.148727 1.164565 2.537886
H  4.606525 0.298773 1.638522
H  3.407496 0.298024 2.937182
H  4.005688 1.822064 2.300741
H  4.306373 -1.105573 -2.267987
H  4.09109 -2.237654 -0.947383
H  4.803637 -0.65361 -0.639678
H  0.59954 -1.00134 -1.598511
H  1.780682 -0.966557 -2.898014
H  1.694836 -2.371383 -1.861636
H  0.277068 2.07744 -0.243208
H  -0.140372 0.508317 0.41398
H  -0.855868 3.194689 1.664149
H  -1.238548 1.630543 2.36208
H  -0.593469 -2.709079 0.457909
H  3.522139 -3.547028 0.687109
H  -2.075381 4.018733 -0.3088
H  -2.855483 0.105836 1.236103
H  -0.126788 -5.296479 -0.312415
H  -4.035415 3.834824 -1.776093
H  -4.814804 -0.088877 -0.228505
elementType: Cl O N C H
totalener: -1513.51089850 hartree
nucrepener: 2401.85508193 hartree
electener: -3915.36598043 hartree
oneelecener: -6840.30680436 hartree
twoeener: 2924.94082393 hartree
cpcmener: -0.03710140 hartree
kineticenergy: 1508.16816351 hartree
xcener: -124.308962404843 hartree
chargesum: -0.0000000
charge: -0.107929 -0.397716 -0.475997 -0.063776 -0.012528 -0.380031 0.361093 0.123676 0.034378 -0.255151 -0.309181 -0.335353 -0.328047 -0.131028 0.327205 -0.057089 0.036728 -0.135091 0.022098 -0.218564 -0.230985 -0.128982 -0.144523 -0.144663 0.082761 0.118079 0.086919 0.101136 0.090405 0.106728 0.102727 0.113438 0.110464 0.113717 0.114380 0.108307 0.127322 0.104476 0.105654 0.067172 0.091238 0.094149 0.183190 0.183810 0.143453 0.143064 0.168794 0.144832 0.145242
qa: -0.1079 -0.3977 -0.4760 -0.0638 -0.0125 -0.3800 0.3611 0.1237 0.0344 -0.2552 -0.3092 -0.3354 -0.3280 -0.1310 0.3272 -0.0571 0.0367 -0.1351 0.0221 -0.2186 -0.2310 -0.1290 -0.1445 -0.1447 0.0828 0.1181 0.0869 0.1011 0.0904 0.1067 0.1027 0.1134 0.1105 0.1137 0.1144 0.1083 0.1273 0.1045 0.1057 0.0672 0.0912 0.0941 0.1832 0.1838 0.1435 0.1431 0.1688 0.1448 0.1452
va: 1.1977 1.9634 2.0210 3.1409 3.2393 3.1077 3.9358 3.8985 3.9470 3.8588 3.9516 3.9580 3.9363 3.8847 4.2752 3.7963 3.5770 3.9007 4.0488 3.9822 3.9731 4.0190 3.9659 3.9720 3.8177 0.9942 0.9892 1.0191 1.0319 1.0043 1.0134 1.0028 1.0014 1.0003 1.0034 0.9995 1.0035 0.9971 1.0077 1.0129 1.0121 1.0088 0.9911 0.9873 1.0034 1.0040 1.0010 1.0044 1.0042
dispcorr: -0.028969736 hartree
energy: -1513.539868237000
dipole: 31.05498 -29.95196 1.10303 1.35633 0.41394 1.77027 3.97074 -4.95083 -0.98009
magnitude: 2.30458 au
magnitude: 5.85779 debye
