program: Orca
programVersion: 4.2.1
elementType: Cl O O N N N C C C C C C C C C C C C C C C C C C C H H H H H H H H H H H H H H H H H H H H H H H H
charge: 0
multiplicity: 1
keywords: wb97x-d3
keywords: def2-TZVPP
keywords: def2/J RIJCOSX GRIDX6 NOFINALGRIDX
keywords: grid4 nofinalgrid
keywords: scfconv7
keywords: smallprint printgap noloewdin
keywords: NOSOSCF
formula: C19H24ClN3O2
InChI: InChI=1/C19H24ClN3O2/c1-18(2)13-25-19(3,23(18)17(24)22-12-11-21-14-22)10-4-5-15-6-8-16(20)9-7-15/h6-9,11-12,14H,4-5,10,13H2,1-3H3
49 atoms
Cl -5.879053 2.167817 -2.090654
O  3.043801 1.530513 0.208652
O  1.280523 -1.624384 2.214087
N  2.284132 -0.591072 0.460316
N  1.607902 -2.834445 0.323049
N  2.127535 -4.787934 -0.546094
C  2.524913 0.67627 1.20564
C  2.673087 -0.448196 -0.966338
C  2.636588 1.075267 -1.06051
C  1.254669 1.280363 1.819796
C  3.600484 0.501379 2.265914
C  4.09044 -0.949945 -1.224181
C  1.688044 -1.033073 -1.968081
C  0.034736 1.380001 0.913746
C  1.714964 -1.626394 1.079001
C  -1.206915 1.825035 1.689327
C  -2.403948 1.925215 0.789067
C  0.424684 -3.40608 -0.074141
C  2.597017 -3.715173 0.026006
C  -3.175839 0.801665 0.502416
C  -2.733803 3.125542 0.165678
C  0.773049 -4.59954 -0.624493
C  -4.24464 0.86538 -0.378981
C  -3.799306 3.211206 -0.718679
C  -4.545935 2.074925 -0.984796
H  3.330914 1.453629 -1.810889
H  1.632465 1.428487 -1.319036
H  1.532803 2.281941 2.160467
H  0.99351 0.722104 2.717978
H  3.836416 1.467123 2.714138
H  4.513849 0.093113 1.833142
H  3.271174 -0.159562 3.064509
H  4.381664 -0.702649 -2.245478
H  4.172528 -2.029774 -1.121489
H  4.813144 -0.489258 -0.550522
H  0.653545 -0.822051 -1.694495
H  1.870118 -0.562469 -2.935604
H  1.802564 -2.104869 -2.115151
H  0.211918 2.089758 0.102533
H  -0.180963 0.416971 0.440955
H  -1.014111 2.790595 2.163077
H  -1.402442 1.112107 2.494297
H  -0.526436 -2.915321 0.047349
H  3.625724 -3.541914 0.297723
H  -2.944553 -0.145437 0.975302
H  -2.151492 4.015611 0.371089
H  0.120665 -5.332086 -1.071495
H  -4.833128 -0.017878 -0.586959
H  -4.0407 4.153539 -1.191359
elementType: Cl O N C H
totalener: -1513.51110682 hartree
nucrepener: 2397.41980529 hartree
electener: -3910.93091212 hartree
oneelecener: -6831.44768675 hartree
twoeener: 2920.51677463 hartree
cpcmener: -0.03706449 hartree
kineticenergy: 1508.16806015 hartree
xcener: -124.309124514794 hartree
chargesum: 0.0000000
charge: -0.108180 -0.399248 -0.476903 -0.067151 -0.014330 -0.379271 0.363522 0.122295 0.033581 -0.260920 -0.312536 -0.336664 -0.327474 -0.128446 0.335515 -0.055385 0.032075 -0.134010 0.020294 -0.230513 -0.216305 -0.129245 -0.145207 -0.147743 0.083894 0.117700 0.088575 0.101485 0.091233 0.114516 0.107430 0.103326 0.110383 0.114042 0.114725 0.108480 0.126880 0.105557 0.104853 0.069555 0.090112 0.095250 0.183403 0.182756 0.144538 0.143506 0.169499 0.145240 0.145314
qa: -0.1082 -0.3992 -0.4769 -0.0672 -0.0143 -0.3793 0.3635 0.1223 0.0336 -0.2609 -0.3125 -0.3367 -0.3275 -0.1284 0.3355 -0.0554 0.0321 -0.1340 0.0203 -0.2305 -0.2163 -0.1292 -0.1452 -0.1477 0.0839 0.1177 0.0886 0.1015 0.0912 0.1145 0.1074 0.1033 0.1104 0.1140 0.1147 0.1085 0.1269 0.1056 0.1049 0.0696 0.0901 0.0952 0.1834 0.1828 0.1445 0.1435 0.1695 0.1452 0.1453
va: 1.1971 1.9625 2.0194 3.1407 3.2416 3.1075 3.9338 3.9000 3.9484 3.8581 3.9523 3.9561 3.9350 3.8772 4.2685 3.7904 3.5788 3.9031 4.0518 3.9733 3.9794 4.0177 3.9747 3.9664 3.8164 0.9948 0.9885 1.0188 1.0318 1.0025 1.0041 1.0127 1.0015 1.0010 1.0035 1.0004 1.0038 0.9961 1.0079 1.0137 1.0122 1.0082 0.9915 0.9875 1.0038 1.0032 1.0004 1.0045 1.0043
dispcorr: -0.028870105 hartree
energy: -1513.539976930080
dipole: 30.67602 -29.62196 1.05407 0.09827 1.72853 1.82680 5.40039 -6.05430 -0.65391
magnitude: 2.20813 au
magnitude: 5.61263 debye
