program: Orca
programVersion: 4.2.1
elementType: Cl O O N N N C C C C C C C C C C C C C C C C C C C H H H H H H H H H H H H H H H H H H H H H H H H
charge: 0
multiplicity: 1
keywords: wb97x-d3
keywords: def2-TZVPP
keywords: def2/J RIJCOSX GRIDX6 NOFINALGRIDX
keywords: grid4 nofinalgrid
keywords: scfconv7
keywords: smallprint printgap noloewdin
keywords: NOSOSCF
formula: C19H24ClN3O2
InChI: InChI=1/C19H24ClN3O2/c1-18(2)13-25-19(3,23(18)17(24)22-12-11-21-14-22)10-4-5-15-6-8-16(20)9-7-15/h6-9,11-12,14H,4-5,10,13H2,1-3H3
49 atoms
Cl -4.626033 1.284843 -2.873675
O  2.397474 1.569519 0.25432
O  1.752359 -2.501788 -1.354473
N  2.274287 -0.64324 -0.15885
N  0.998337 -2.377064 0.781689
N  0.618843 -3.392961 2.696409
C  1.971259 0.389364 0.891549
C  3.091506 -0.045297 -1.242982
C  3.5103 1.24405 -0.545436
C  0.475131 0.523978 1.167589
C  2.784051 0.17041 2.163753
C  4.310296 -0.878367 -1.607031
C  2.246999 0.280308 -2.474236
C  0.076216 1.817328 1.870082
C  1.704589 -1.838127 -0.337635
C  -1.422289 1.833116 2.193972
C  -2.273049 1.704219 0.962498
C  -0.338784 -2.691338 0.792377
C  1.526183 -2.835374 1.946201
C  -2.424497 2.782441 0.093383
C  -2.874393 0.496013 0.621383
C  -0.552055 -3.29604 1.991055
C  -3.146413 2.664733 -1.083987
C  -3.601865 0.356909 -0.552498
C  -3.727931 1.446118 -1.39856
H  4.414077 1.099061 0.057962
H  3.696154 2.057197 -1.244787
H  0.144253 -0.308166 1.789658
H  -0.06097 0.444218 0.218109
H  2.376312 -0.629394 2.776042
H  2.766683 1.077202 2.767506
H  3.825252 -0.067839 1.949541
H  4.86148 -1.190769 -0.719553
H  4.98306 -0.273297 -2.216749
H  4.051954 -1.762352 -2.18535
H  1.394978 0.91188 -2.219826
H  2.858248 0.821041 -3.197662
H  1.874777 -0.616571 -2.963712
H  0.625365 1.930761 2.80733
H  0.319608 2.68365 1.252511
H  -1.657434 2.76521 2.712218
H  -1.651764 1.020933 2.887916
H  -0.999542 -2.435899 -0.018938
H  2.580206 -2.77688 2.165515
H  -1.970426 3.736203 0.334575
H  -2.771414 -0.360303 1.27747
H  -1.485048 -3.667423 2.383058
H  -3.252733 3.513741 -1.745518
H  -4.059851 -0.590997 -0.800565
elementType: Cl O N C H
totalener: -1513.50991736 hartree
nucrepener: 2463.37128945 hartree
electener: -3976.88120681 hartree
oneelecener: -6963.65425577 hartree
twoeener: 2986.77304896 hartree
cpcmener: -0.03643334 hartree
kineticenergy: 1508.17172903 hartree
xcener: -124.309764710776 hartree
chargesum: -0.0000000
charge: -0.107725 -0.375958 -0.481874 -0.047249 -0.027579 -0.382235 0.208660 0.139627 0.073813 -0.169930 -0.326501 -0.319990 -0.355120 -0.144709 0.383343 -0.090314 0.039914 -0.159114 0.026587 -0.211193 -0.202626 -0.114225 -0.149754 -0.146890 0.090949 0.085584 0.113140 0.081788 0.105701 0.120872 0.112913 0.112794 0.102200 0.113290 0.106232 0.106236 0.108859 0.108235 0.088996 0.082106 0.102307 0.091990 0.181018 0.186318 0.143258 0.137618 0.168238 0.145269 0.145130
qa: -0.1077 -0.3760 -0.4819 -0.0472 -0.0276 -0.3822 0.2087 0.1396 0.0738 -0.1699 -0.3265 -0.3200 -0.3551 -0.1447 0.3833 -0.0903 0.0399 -0.1591 0.0266 -0.2112 -0.2026 -0.1142 -0.1498 -0.1469 0.0909 0.0856 0.1131 0.0818 0.1057 0.1209 0.1129 0.1128 0.1022 0.1133 0.1062 0.1062 0.1089 0.1082 0.0890 0.0821 0.1023 0.0920 0.1810 0.1863 0.1433 0.1376 0.1682 0.1453 0.1451
va: 1.1975 1.9550 2.0234 3.1411 3.2492 3.1034 4.1124 3.9186 3.8966 3.8341 3.9660 3.9108 3.9263 3.9011 4.2355 3.8200 3.5438 3.9130 4.0336 3.9834 3.9261 4.0213 3.9719 3.9877 3.8148 1.0032 0.9940 1.0038 1.0065 0.9981 1.0065 1.0043 1.0046 0.9997 1.0148 1.0067 1.0018 1.0183 1.0159 1.0261 1.0064 1.0102 0.9966 0.9868 1.0026 1.0066 1.0011 1.0040 1.0043
dispcorr: -0.029975327 hartree
energy: -1513.539892690457
dipole: 27.97748 -26.35619 1.62130 5.28116 -3.07891 2.20225 11.39076 -10.80416 0.58659
magnitude: 2.79689 au
magnitude: 7.10912 debye
