program: Gaussian 09
title: 000068343
version: EM64L-G09RevD.01
frameworkgroup: C1[X(C8H9ClN2S)]
method: RPBEPBE
basis: SDD
operation: Freq
keyword: #p
keyword: freq=noraman
keyword: PBEPBE/SDD
title: #p freq=noraman PBEPBE/SDD
converged: YES YES NO NO
title: Mulliken charges:
elementType: Cl S N N C C C C C C C C H H H H H H H H H
charge: -0.067417 0.143847 -0.600716 -0.348415 0.558756 -0.881390 -0.393606 -0.345766 -0.207126 -0.207781 -0.098358 -0.063179 0.329926 0.273489 0.236672 0.282489 0.253416 0.252049 0.320533 0.331478 0.231100
chargesum: 0.00000
title: Mulliken charges with hydrogens summed into heavy atoms:
elementType: Cl S N N C C C C C C C C
charge: -0.067417 0.143847 0.051295 -0.117315 0.558756 -0.277975 -0.156934 -0.063277 0.046290 0.044268 -0.098358 -0.063179
polarizability: 1.83978398e+02 5.63408330e+00 1.20989917e+02 -3.84801158e-01 -8.74219478e+00 7.88357539e+01
1716.lowfreq: -7.8072 -0.0023 -0.0016 0.0021 5.1349 12.4121 22.6472 42.9913 51.3997
frequency: 22.4801 42.9497 51.3467 70.6030 162.3505 174.2361 258.1871 298.5476 335.7995 349.6207 376.9198 402.2448 409.5986 420.7439 458.1810 499.9636 557.2795 587.9348 613.7103 625.0714 640.1440 719.1496 725.9086 800.6934 830.0812 847.8482 884.6998 954.1264 984.7089 989.4496 1001.3813 1046.0979 1069.9712 1102.9109 1180.2921 1183.5565 1221.5714 1253.5656 1287.4919 1297.6721 1378.9037 1399.2671 1439.7941 1476.4190 1586.4660 1599.3656 1615.2384 1641.5092 3013.5494 3106.7167 3129.7779 3139.7383 3167.7680 3171.2088 3378.6704 3527.5093 3674.5676
redmass: 5.0581 4.5133 5.1880 11.9182 9.2899 7.5645 3.6010 6.3803 1.0907 2.6911 5.3294 3.4176 2.9228 1.2910 7.0483 3.6560 3.0008 2.7771 4.9152 6.7642 6.5723 1.4614 3.3009 4.4596 1.3643 1.4670 1.7281 1.3680 1.3753 1.6993 4.2156 1.5691 2.6642 1.3567 1.0806 1.1197 3.2586 1.1877 2.6831 1.2795 7.2718 2.6263 1.1293 2.4667 7.3753 6.1380 1.4880 2.7229 1.0614 1.1042 1.0899 1.0907 1.0952 1.0960 1.0770 1.0450 1.1042
irintensity: 4.3279 6.1769 1.1070 4.9252 2.9612 5.2433 3.6627 0.9635 5.2904 4.9927 34.0197 20.5839 0.0728 278.5126 2.0535 22.6742 22.3634 74.9454 25.0526 0.9793 16.1621 88.3833 14.4749 35.1372 13.6342 39.2364 12.3432 0.3024 9.1023 127.6859 34.8683 5.4376 33.6733 11.0742 0.5547 2.2857 10.0895 27.5912 196.7852 2.2446 0.7918 6.4640 25.6516 82.1728 1.0177 12.3585 93.3526 253.9213 24.6117 7.0489 11.3273 0.5589 6.1709 3.2990 18.7100 39.5911 24.8237
temp: 298.150 k
press: 1.00000 atm
elementType: 17 16 7 7 6 6 6 6 6 6 6 6 1 1 1 1 1 1 1 1 1
symmnumber: 1
zpe: 407840.2 jmol-1
zpe.correction: 0.155338 hartree
zpe.thermalcorrener: 0.167748 hartree
zpe.thermalcorrenthalpy: 0.168693 hartree
zpe.thermalcorrgfe: 0.114309 hartree
zpe.sumelectzpe: -1276.989010 hartree
zpe.sumelectthermal: -1276.976600 hartree
zpe.sumelectthermalent: -1276.975656 hartree
zpe.sumelectthermalfe: -1277.030040 hartree
dipole: -4.4232 -0.8279 -0.7446
dipole: 4.5612
quadrupole: -75.5234 -74.0425 -86.7829
quadrupole: 13.3011 6.7915 0.7117
quadrupole: 3.2595 4.7404 -7.9999 13.3011 6.7915 0.7117
hfenergy: -1277.1443485 hartree
pointgroup: C01 [X(C8H9Cl1N2S1)]
dipole: -1.7627356 -0.1149533 -0.3159802 debye
dipolederiv: -0.8132642 0.231083 0.1638087 0.2693327 -0.2274608 -0.062717 0.2111546 -0.0695688 -0.1274054 -0.7101192 -0.1149854 -0.009921 -0.2330908 -0.3714967 -0.0306681 -0.1993598 0.0322261 -0.1544564 -1.1692547 0.0674201 -0.3398336 -0.1509063 -0.3894686 -0.2388583 -0.3549092 -0.1328874 -0.8271057 -0.4771571 0.2273457 -0.1262816 0.0161817 -0.747024 0.3464347 0.0795293 0.4847901 -0.8794119 0.1457588 -0.0244928 -0.0185251 -0.0833322 -0.0687489 -0.0196472 0.0100021 -0.0510204 -0.1019554 0.5918132 -0.0781547 0.1081707 -0.1915009 0.0803 0.089336 0.2923864 0.1143346 0.1475697 -0.0311684 -0.0313074 -0.052089 0.0552401 0.1004836 0.0132327 -0.0559915 0.0081105 -0.1326733 -0.0474111 0.0398553 -0.0401683 0.0245136 -0.0018216 0.0276553 -0.0062683 0.0041278 -0.1139697 -0.2384155 0.1543206 0.0244021 0.2060602 -0.10492 -0.0331955 0.0566076 -0.0398928 -0.1120323 -0.3375103 0.0358222 0.0436031 0.0285011 0.0278217 -0.0212155 0.0647216 -0.0014363 -0.1192015 1.0673644 -0.3409881 -0.2947732 -0.4004778 0.2754316 0.1044211 -0.3288765 0.1085819 0.0166288 1.0797172 0.2898693 0.5602292 0.7348862 0.9673842 -0.3232618 0.4382983 -0.4827896 0.9170781 0.0494025 0.0557984 0.0124947 0.0906197 0.1191686 0.0842044 -0.0356163 0.0147696 0.0361849 -0.0118679 -0.041865 -0.0547341 0.0366704 -0.0611835 -0.0988726 -0.0485314 -0.0510213 0.0601942 0.0786322 0.0625041 0.0297717 0.0394956 -0.0916952 -0.0228092 0.0166228 -0.0227378 0.1350793 0.1036888 -0.0717309 0.0478464 -0.0629669 0.052572 -0.005487 0.0221247 0.0061549 0.1304287 -0.0050633 -0.0755425 0.0365305 -0.0690115 0.0453173 0.0118117 0.0460279 0.0138343 0.1559372 0.0860721 0.0278068 0.019991 0.0368182 -0.0479038 -0.0126107 0.0216454 -0.0162676 0.1559135 0.2589475 -0.0829191 -0.0705326 -0.0890721 0.1761604 0.0820928 -0.0810447 0.0787747 0.2489331 0.3424295 -0.0749284 -0.0570832 -0.048973 0.1993775 0.0990895 -0.0421808 0.0821367 0.2662251 0.0374055 -0.2549111 0.0170934 -0.2089879 0.0677063 0.0110647 -0.1063422 -0.0802194 0.2980391 unknown
polarizability: 184.4799834|-0.3672782|122.0476243|-0.9996701|-2.8208254|77.2764614 unknown
InChI: InChI=1S/C8H9ClN2S/c9-7-3-1-6(2-4-7)5-12-8(10)11/h1-4,10H,5,11H2
charge 0 multiplicity 1
21 atoms
Cl 4.384551 -1.069956 -0.683952
S  -2.364841 1.25102 -0.515098
N  -4.349433 -0.431065 -1.172493
N  -3.020455 -1.104243 0.752975
C  0.22223 0.597095 0.532971
C  -1.130534 1.124522 0.940284
C  1.305851 1.475382 0.276784
C  0.432517 -0.802785 0.413488
C  2.575692 0.978498 -0.095521
C  1.693462 -1.316953 0.04274
C  2.746205 -0.414025 -0.206501
C  -3.33462 -0.306576 -0.230606
H  -1.646036 0.44274 1.639461
H  -1.08601 2.146216 1.348265
H  1.162508 2.558876 0.366386
H  -0.407215 -1.478921 0.609826
H  3.410631 1.657309 -0.29156
H  1.856463 -2.395046 -0.046587
H  -4.95217 -1.251461 -1.172883
H  -4.495161 0.277919 -1.889427
H  -3.623832 -1.938547 0.868947
