program: Orca
programVersion: 4.2.1
elementType: Cl O O N N N C C C C C C C C C C C C C C C C C C C H H H H H H H H H H H H H H H H H H H H H H H H
charge: 0
multiplicity: 1
keywords: wb97x-d3
keywords: def2-TZVPP
keywords: def2/J RIJCOSX GRIDX6 NOFINALGRIDX
keywords: grid4 nofinalgrid
keywords: scfconv7
keywords: smallprint printgap noloewdin
keywords: NOSOSCF
formula: C19H24ClN3O2
InChI: InChI=1/C19H24ClN3O2/c1-18(2)13-25-19(3,23(18)17(24)22-12-11-21-14-22)10-4-5-15-6-8-16(20)9-7-15/h6-9,11-12,14H,4-5,10,13H2,1-3H3
49 atoms
Cl -5.514922 2.648291 -2.405573
O  2.806726 1.373046 0.971522
O  1.81104 -2.076041 -1.631531
N  2.510273 -0.610591 -0.047405
N  1.308823 -2.547249 0.530329
N  1.115783 -4.10826 2.06904
C  2.410647 0.061006 1.287204
C  3.237233 0.254256 -1.009797
C  3.78339 1.297548 -0.037102
C  0.998971 0.144724 1.862862
C  3.378574 -0.532116 2.308413
C  4.376926 -0.466336 -1.713136
C  2.292135 0.918624 -2.008456
C  -0.065242 0.695255 0.925871
C  1.899986 -1.71926 -0.476087
C  -1.445036 0.711056 1.586768
C  -2.500488 1.193058 0.633507
C  -0.024642 -2.87215 0.588051
C  1.949682 -3.34013 1.429882
C  -3.257205 0.293507 -0.11187
C  -2.703549 2.554748 0.421278
C  -0.121395 -3.815683 1.563015
C  -4.186259 0.728843 -1.045808
C  -3.626627 3.011079 -0.507314
C  -4.360681 2.089475 -1.237554
H  4.76141 1.001704 0.364042
H  3.893011 2.279366 -0.498402
H  1.072667 0.788628 2.744935
H  0.694753 -0.829557 2.247773
H  4.359361 -0.740636 1.880335
H  3.003392 -1.454169 2.745173
H  3.508607 0.17629 3.127553
H  4.028929 -1.151298 -2.483276
H  4.991547 -1.024675 -1.005259
H  5.01963 0.271505 -2.197579
H  1.518978 1.499364 -1.503782
H  2.859434 1.604255 -2.640496
H  1.806735 0.197255 -2.661905
H  0.193945 1.709686 0.61451
H  -0.126548 0.104214 0.007963
H  -1.41764 1.351613 2.472361
H  -1.693712 -0.294381 1.937948
H  -0.762669 -2.407203 -0.043611
H  3.022319 -3.332534 1.541913
H  -3.126643 -0.772305 0.034923
H  -2.132849 3.279667 0.989895
H  -1.014629 -4.302157 1.922602
H  -4.763675 0.011925 -1.614016
H  -3.769208 4.072954 -0.656753
elementType: Cl O N C H
totalener: -1513.52285565 hartree
nucrepener: 2419.62717149 hartree
electener: -3933.15002715 hartree
oneelecener: -6875.92873006 hartree
twoeener: 2942.77870291 hartree
cpcmener: -0.03114690 hartree
kineticenergy: 1508.15373418 hartree
xcener: -124.304605259377 hartree
chargesum: -0.0000000
charge: -0.105078 -0.369509 -0.448292 -0.039749 -0.011900 -0.372533 0.224529 0.126132 0.075573 -0.163917 -0.326771 -0.323503 -0.356417 -0.182442 0.325193 -0.072964 0.050310 -0.153196 0.025385 -0.215731 -0.219038 -0.114224 -0.150436 -0.144478 0.084401 0.081061 0.110697 0.111041 0.096005 0.110933 0.118449 0.115068 0.108133 0.099138 0.114939 0.112861 0.109462 0.112771 0.096539 0.083053 0.102290 0.089970 0.174662 0.180597 0.138756 0.141973 0.165620 0.142798 0.141839
qa: -0.1051 -0.3695 -0.4483 -0.0397 -0.0119 -0.3725 0.2245 0.1261 0.0756 -0.1639 -0.3268 -0.3235 -0.3564 -0.1824 0.3252 -0.0730 0.0503 -0.1532 0.0254 -0.2157 -0.2190 -0.1142 -0.1504 -0.1445 0.0844 0.0811 0.1107 0.1110 0.0960 0.1109 0.1184 0.1151 0.1081 0.0991 0.1149 0.1129 0.1095 0.1128 0.0965 0.0831 0.1023 0.0900 0.1747 0.1806 0.1388 0.1420 0.1656 0.1428 0.1418
va: 1.2003 1.9792 2.0576 3.1342 3.2453 3.1059 4.1007 3.9161 3.8976 3.7270 3.9509 3.9166 3.9253 3.8819 4.2744 3.7724 3.5485 3.9144 4.0409 3.9846 3.9904 4.0271 3.9998 3.9762 3.8308 1.0031 0.9935 1.0221 1.0057 1.0029 0.9967 1.0113 1.0155 1.0040 0.9988 0.9980 1.0032 1.0184 1.0327 1.0078 1.0098 1.0147 0.9966 0.9866 1.0037 1.0031 1.0013 1.0056 1.0053
dispcorr: -0.029797604 hartree
energy: -1513.552653258595
dipole: 31.93470 -30.20076 1.73394 -1.54058 3.23283 1.69225 10.05696 -9.29402 0.76294
magnitude: 2.54014 au
magnitude: 6.45653 debye
