program: Orca
programVersion: 4.2.1
elementType: Cl O O N N N C C C C C C C C C C C C C C C C C C C H H H H H H H H H H H H H H H H H H H H H H H H
charge: 0
multiplicity: 1
keywords: wb97x-d3
keywords: def2-TZVPP
keywords: def2/J RIJCOSX GRIDX6 NOFINALGRIDX
keywords: grid4 nofinalgrid
keywords: scfconv7
keywords: smallprint printgap noloewdin
keywords: NOSOSCF
formula: C19H24ClN3O2
InChI: InChI=1/C19H24ClN3O2/c1-18(2)13-25-19(3,23(18)17(24)22-12-11-21-14-22)10-4-5-15-6-8-16(20)9-7-15/h6-9,11-12,14H,4-5,10,13H2,1-3H3
49 atoms
Cl -5.501121 3.152185 1.625223
O  2.03664 1.457262 0.557845
O  3.325651 -2.234776 -1.532928
N  2.643985 -0.598839 -0.118465
N  1.498867 -2.650546 -0.256061
N  -0.256976 -3.962261 -0.447616
C  1.628364 0.120821 0.711857
C  3.776762 0.302598 -0.445551
C  3.440559 1.46919 0.482061
C  0.190437 0.02896 0.208478
C  1.704616 -0.272947 2.185497
C  5.130836 -0.291399 -0.087299
C  3.735279 0.765357 -1.900486
C  -0.03181 0.413833 -1.247139
C  2.56913 -1.805909 -0.687358
C  -1.471365 0.156574 -1.702922
C  -2.495655 0.895681 -0.888012
C  1.360431 -3.289323 0.951447
C  0.512002 -3.115359 -1.067878
C  -2.661433 2.271744 -1.03229
C  -3.280459 0.236427 0.053315
C  0.267054 -4.087693 0.809811
C  -3.579745 2.972452 -0.266134
C  -4.205247 0.919062 0.831047
C  -4.346407 2.286227 0.663441
H  3.901251 1.343852 1.470126
H  3.765802 2.428324 0.079278
H  -0.390321 0.694751 0.853374
H  -0.205125 -0.968217 0.407134
H  1.217989 -1.225531 2.378652
H  1.184814 0.478402 2.781159
H  2.731006 -0.343023 2.546098
H  5.454024 -1.051438 -0.795077
H  5.121687 -0.730302 0.911454
H  5.881494 0.501144 -0.092482
H  2.792588 1.260392 -2.137162
H  4.538644 1.483072 -2.074758
H  3.874433 -0.057634 -2.59772
H  0.215762 1.4671 -1.397028
H  0.63097 -0.149669 -1.909314
H  -1.679023 -0.915855 -1.659679
H  -1.559784 0.444078 -2.753451
H  2.05506 -3.158241 1.762983
H  0.402927 -2.781842 -2.088538
H  -2.067721 2.813677 -1.759266
H  -3.175288 -0.833708 0.187102
H  -0.161418 -4.75232 1.543565
H  -3.696904 4.039977 -0.39641
H  -4.806145 0.386164 1.555823
elementType: Cl O N C H
totalener: -1513.52168465 hartree
nucrepener: 2432.69661566 hartree
electener: -3946.21830032 hartree
oneelecener: -6902.25258869 hartree
twoeener: 2956.03428837 hartree
cpcmener: -0.03049822 hartree
kineticenergy: 1508.15714657 hartree
xcener: -124.306901592005 hartree
chargesum: -0.0000000
charge: -0.105292 -0.368795 -0.450154 -0.036106 -0.009617 -0.369328 0.205905 0.135622 0.075472 -0.155007 -0.317728 -0.325142 -0.360779 -0.153717 0.326461 -0.121587 0.022873 -0.155549 0.021368 -0.198294 -0.179113 -0.121116 -0.151943 -0.149453 0.091929 0.080966 0.110718 0.108499 0.088964 0.114842 0.113651 0.109569 0.107823 0.099385 0.114618 0.110611 0.110084 0.113277 0.093618 0.085852 0.093097 0.105896 0.192105 0.171941 0.140469 0.133212 0.165037 0.142204 0.142652
qa: -0.1053 -0.3688 -0.4502 -0.0361 -0.0096 -0.3693 0.2059 0.1356 0.0755 -0.1550 -0.3177 -0.3251 -0.3608 -0.1537 0.3265 -0.1216 0.0229 -0.1555 0.0214 -0.1983 -0.1791 -0.1211 -0.1519 -0.1495 0.0919 0.0810 0.1107 0.1085 0.0890 0.1148 0.1137 0.1096 0.1078 0.0994 0.1146 0.1106 0.1101 0.1133 0.0936 0.0859 0.0931 0.1059 0.1921 0.1719 0.1405 0.1332 0.1650 0.1422 0.1427
va: 1.2000 1.9796 2.0577 3.1284 3.2400 3.0936 4.1630 3.9040 3.8940 3.6959 3.9475 3.9191 3.9279 3.8758 4.2782 3.8428 3.5612 3.9057 4.0303 3.9794 3.9330 4.0307 3.9854 3.9971 3.8219 1.0036 0.9932 1.0228 1.0060 1.0016 1.0108 1.0037 1.0156 1.0036 0.9990 0.9989 1.0027 1.0174 1.0228 1.0147 1.0145 1.0051 0.9809 0.9965 1.0034 1.0086 1.0021 1.0051 1.0048
dispcorr: -0.030308948 hartree
energy: -1513.551993602091
dipole: 31.99763 -30.15401 1.84362 -3.83777 5.30075 1.46298 -5.07792 5.94110 0.86318
magnitude: 2.50686 au
magnitude: 6.37193 debye
