program: Orca
programVersion: 4.2.1
elementType: Cl O O N N N C C C C C C C C C C C C C C C C C C C H H H H H H H H H H H H H H H H H H H H H H H H
charge: 0
multiplicity: 1
keywords: wb97x-d3
keywords: def2-TZVPP
keywords: def2/J RIJCOSX GRIDX6 NOFINALGRIDX
keywords: grid4 nofinalgrid
keywords: scfconv7
keywords: smallprint printgap noloewdin
keywords: NOSOSCF
formula: C19H24ClN3O2
InChI: InChI=1/C19H24ClN3O2/c1-18(2)13-25-19(3,23(18)17(24)22-12-11-21-14-22)10-4-5-15-6-8-16(20)9-7-15/h6-9,11-12,14H,4-5,10,13H2,1-3H3
49 atoms
Cl -5.407295 3.362164 1.7255
O  1.851474 1.275823 0.838913
O  3.372129 -2.0127 -1.723089
N  2.590101 -0.626358 -0.108046
N  1.600897 -2.725404 -0.496375
N  -0.023337 -4.169427 -0.840523
C  1.519558 -0.089841 0.790714
C  3.659275 0.384047 -0.30099
C  3.252328 1.379472 0.783321
C  0.100175 -0.187997 0.237305
C  1.589144 -0.684632 2.195103
C  5.052143 -0.162138 -0.025732
C  3.579609 1.042924 -1.676223
C  -0.103043 0.349809 -1.170864
C  2.596114 -1.751475 -0.828655
C  -1.549996 0.196412 -1.65026
C  -2.532953 0.975214 -0.821547
C  1.56861 -3.542236 0.607618
C  0.636699 -3.168865 -1.346585
C  -3.348595 0.348769 0.115894
C  -2.627556 2.359557 -0.951727
C  0.555656 -4.420417 0.373119
C  -4.233675 1.071707 0.903787
C  -3.505217 3.100137 -0.175669
C  -4.303411 2.445926 0.750213
H  3.715827 1.13456 1.747514
H  3.522958 2.404732 0.530588
H  -0.525507 0.373885 0.937125
H  -0.25184 -1.218534 0.308157
H  2.609267 -0.736365 2.576873
H  1.165527 -1.684922 2.234963
H  1.003501 -0.062007 2.87271
H  5.425791 -0.785771 -0.834594
H  5.078419 -0.740426 0.899093
H  5.744535 0.673988 0.089151
H  2.606179 1.504947 -1.844819
H  4.334042 1.828431 -1.745547
H  3.767568 0.33621 -2.481427
H  0.181985 1.403515 -1.215301
H  0.540504 -0.168907 -1.886338
H  -1.825003 -0.861764 -1.648161
H  -1.606526 0.527045 -2.690087
H  2.272438 -3.454456 1.417396
H  0.4594 -2.706693 -2.30552
H  -3.301077 -0.726706 0.238568
H  -2.008808 2.87673 -1.675845
H  0.220023 -5.221743 1.012506
H  -4.859537 0.563574 1.625103
H  -3.566115 4.173473 -0.296004
elementType: Cl O N C H
totalener: -1513.52201921 hartree
nucrepener: 2425.60246521 hartree
electener: -3939.12448442 hartree
oneelecener: -6888.02101872 hartree
twoeener: 2948.89653431 hartree
cpcmener: -0.03090375 hartree
kineticenergy: 1508.15525969 hartree
xcener: -124.305929804901 hartree
chargesum: -0.0000000
charge: -0.105312 -0.368637 -0.447909 -0.035579 -0.013054 -0.369854 0.217039 0.130410 0.074014 -0.161369 -0.321892 -0.324741 -0.355829 -0.159909 0.321410 -0.112060 0.031283 -0.153674 0.027997 -0.197770 -0.208405 -0.121524 -0.135998 -0.150065 0.085338 0.081975 0.109762 0.108581 0.092104 0.109746 0.116957 0.113382 0.107549 0.099618 0.115271 0.111565 0.109807 0.111906 0.092153 0.088124 0.093237 0.105808 0.191586 0.168381 0.137286 0.141044 0.165195 0.142933 0.142119
qa: -0.1053 -0.3686 -0.4479 -0.0356 -0.0131 -0.3699 0.2170 0.1304 0.0740 -0.1614 -0.3219 -0.3247 -0.3558 -0.1599 0.3214 -0.1121 0.0313 -0.1537 0.0280 -0.1978 -0.2084 -0.1215 -0.1360 -0.1501 0.0853 0.0820 0.1098 0.1086 0.0921 0.1097 0.1170 0.1134 0.1075 0.0996 0.1153 0.1116 0.1098 0.1119 0.0922 0.0881 0.0932 0.1058 0.1916 0.1684 0.1373 0.1410 0.1652 0.1429 0.1421
va: 1.2000 1.9810 2.0598 3.1292 3.2425 3.1041 4.1550 3.9144 3.9017 3.6949 3.9472 3.9164 3.9258 3.8894 4.2841 3.8404 3.5512 3.9089 4.0366 3.9382 3.9882 4.0376 3.9777 3.9829 3.8278 1.0033 0.9935 1.0256 1.0070 1.0039 1.0006 1.0110 1.0158 1.0040 0.9986 0.9984 1.0027 1.0182 1.0237 1.0136 1.0137 1.0049 0.9808 0.9993 1.0053 1.0031 1.0022 1.0045 1.0051
dispcorr: -0.030037366 hartree
energy: -1513.552056572683
dipole: 30.65005 -28.99458 1.65547 -4.93539 6.25865 1.32327 -4.24045 5.30984 1.06939
magnitude: 2.37386 au
magnitude: 6.03386 debye
