program: Orca
programVersion: 4.2.1
elementType: Cl O O N N N C C C C C C C C C C C C C C C C C C C H H H H H H H H H H H H H H H H H H H H H H H H
charge: 0
multiplicity: 1
keywords: wb97x-d3
keywords: def2-TZVPP
keywords: def2/J RIJCOSX GRIDX6 NOFINALGRIDX
keywords: grid4 nofinalgrid
keywords: scfconv7
keywords: smallprint printgap noloewdin
keywords: NOSOSCF
formula: C19H24ClN3O2
InChI: InChI=1/C19H24ClN3O2/c1-18(2)13-25-19(3,23(18)17(24)22-12-11-21-14-22)10-4-5-15-6-8-16(20)9-7-15/h6-9,11-12,14H,4-5,10,13H2,1-3H3
49 atoms
Cl -4.52865 -1.207595 0.245101
O  3.357717 1.589962 0.442861
O  0.172672 -0.699907 1.711389
N  1.835001 -0.055387 0.299309
N  0.324386 -1.755134 -0.285755
N  -0.68041 -2.57687 -2.064634
C  2.232573 1.114044 1.135743
C  2.950588 -0.446031 -0.609176
C  4.046348 0.462837 -0.034947
C  1.167103 2.202819 1.147415
C  2.621533 0.72177 2.562626
C  3.359219 -1.90639 -0.478245
C  2.721099 -0.080341 -2.072672
C  0.789647 2.770086 -0.217193
C  0.775307 -0.795738 0.665189
C  -0.629316 3.355317 -0.23863
C  -1.670356 2.27756 -0.119577
C  0.001633 -3.057083 0.016142
C  -0.132696 -1.51876 -1.546181
C  -2.001224 1.499457 -1.227422
C  -2.271648 1.968412 1.096909
C  -0.590695 -3.548824 -1.103236
C  -2.881542 0.433745 -1.128422
C  -3.151574 0.902729 1.218887
C  -3.443164 0.137767 0.103072
H  4.603696 -0.043055 0.763355
H  4.762051 0.77761 -0.79395
H  1.525351 3.008397 1.7949
H  0.290567 1.794099 1.650279
H  3.260293 -0.161737 2.596444
H  1.750958 0.521723 3.18104
H  3.169441 1.54936 3.015741
H  3.428974 -2.217154 0.565181
H  4.345647 -2.039418 -0.926436
H  2.683533 -2.585254 -0.996132
H  2.40128 0.955034 -2.192702
H  3.657389 -0.200987 -2.619694
H  1.994177 -0.725127 -2.559758
H  1.500866 3.543651 -0.511857
H  0.84666 1.995031 -0.985391
H  -0.77068 3.901391 -1.174259
H  -0.744435 4.084286 0.567823
H  0.244196 -3.507116 0.963806
H  -0.075168 -0.545758 -2.00485
H  -1.561975 1.724427 -2.192824
H  -2.04982 2.562875 1.975171
H  -0.957756 -4.549488 -1.269575
H  -3.117892 -0.16174 -1.999803
H  -3.59797 0.674062 2.177306
elementType: Cl O N C H
totalener: -1513.51801310 hartree
nucrepener: 2573.54462704 hartree
electener: -4087.06264015 hartree
oneelecener: -7185.07961225 hartree
twoeener: 3098.01697211 hartree
cpcmener: -0.02938952 hartree
kineticenergy: 1508.16448608 hartree
xcener: -124.310039252065 hartree
chargesum: -0.0000000
charge: -0.110400 -0.381974 -0.439500 -0.024624 0.026899 -0.369995 0.245379 0.085401 0.094560 -0.181749 -0.322871 -0.333164 -0.368454 -0.126085 0.326644 -0.108402 0.112732 -0.165250 -0.011291 -0.291442 -0.222825 -0.099117 -0.131155 -0.134506 0.109917 0.082116 0.108308 0.107146 0.092687 0.099767 0.110626 0.110367 0.111257 0.119686 0.105520 0.125130 0.114679 0.117388 0.087073 0.048634 0.097580 0.088068 0.179727 0.177548 0.151879 0.144873 0.164100 0.137197 0.139912
qa: -0.1104 -0.3820 -0.4395 -0.0246 0.0269 -0.3700 0.2454 0.0854 0.0946 -0.1817 -0.3229 -0.3332 -0.3685 -0.1261 0.3266 -0.1084 0.1127 -0.1652 -0.0113 -0.2914 -0.2228 -0.0991 -0.1312 -0.1345 0.1099 0.0821 0.1083 0.1071 0.0927 0.0998 0.1106 0.1104 0.1113 0.1197 0.1055 0.1251 0.1147 0.1174 0.0871 0.0486 0.0976 0.0881 0.1797 0.1775 0.1519 0.1449 0.1641 0.1372 0.1399
va: 1.1944 1.9753 2.0621 3.1084 3.2348 3.1041 4.1286 3.9317 3.8724 3.7282 3.9400 3.9502 3.9281 3.9133 4.2286 3.8962 3.5130 3.9226 4.0806 3.9175 3.9568 4.0046 3.8915 3.9850 3.7893 1.0036 0.9935 1.0178 1.0304 1.0033 1.0178 1.0108 1.0002 1.0027 0.9968 0.9954 1.0048 1.0013 1.0204 1.0212 1.0062 1.0075 0.9990 0.9831 0.9980 0.9975 0.9991 1.0139 1.0047
dispcorr: -0.033966706 hartree
energy: -1513.551979810999
dipole: 32.53781 -29.64918 2.88863 11.41843 -10.38066 1.03777 -1.42809 1.52387 0.09579
magnitude: 3.07088 au
magnitude: 7.80555 debye
