program: Orca
programVersion: 4.2.1
elementType: Cl O O N N N C C C C C C C C C C C C C C C C C C C H H H H H H H H H H H H H H H H H H H H H H H H
charge: 0
multiplicity: 1
keywords: wb97x-d3
keywords: def2-TZVPP
keywords: def2/J RIJCOSX GRIDX6 NOFINALGRIDX
keywords: grid4 nofinalgrid
keywords: scfconv7
keywords: smallprint printgap noloewdin
keywords: NOSOSCF
formula: C19H24ClN3O2
InChI: InChI=1/C19H24ClN3O2/c1-18(2)13-25-19(3,23(18)17(24)22-12-11-21-14-22)10-4-5-15-6-8-16(20)9-7-15/h6-9,11-12,14H,4-5,10,13H2,1-3H3
49 atoms
Cl -6.061513 1.852261 -2.005462
O  2.999634 1.552556 -0.236043
O  1.557279 -1.284218 2.397414
N  2.320058 -0.513244 0.406089
N  1.701056 -2.765406 0.683191
N  0.645453 -4.589597 0.054155
C  2.577222 0.86088 0.917916
C  2.642981 -0.606925 -1.038321
C  2.562064 0.877438 -1.388028
C  1.334062 1.530705 1.518071
C  3.730264 0.887512 1.910631
C  4.061799 -1.121022 -1.266769
C  1.637116 -1.372979 -1.885744
C  0.067563 1.50004 0.673348
C  1.863714 -1.455306 1.236837
C  -1.130945 2.060018 1.443245
C  -2.38368 2.027072 0.616435
C  2.667798 -3.716254 0.470627
C  0.501832 -3.354064 0.437313
C  -2.768454 3.123357 -0.150198
C  -3.162984 0.874275 0.551841
C  1.99121 -4.830893 0.078058
C  -3.895591 3.080137 -0.95775
C  -4.292628 0.809851 -0.249534
C  -4.649401 1.918551 -1.000895
H  3.219015 1.136526 -2.219361
H  1.540077 1.158932 -1.667147
H  1.612935 2.571585 1.707954
H  1.129282 1.093302 2.494599
H  3.977818 1.920552 2.158047
H  4.619835 0.416931 1.49126
H  3.477236 0.379322 2.838304
H  4.29716 -1.088052 -2.331433
H  4.182257 -2.153195 -0.944623
H  4.803151 -0.514608 -0.7456
H  0.608271 -1.131959 -1.616146
H  1.773953 -1.076361 -2.927474
H  1.772649 -2.452085 -1.850696
H  0.199482 2.083272 -0.241181
H  -0.168682 0.478429 0.360372
H  -0.916508 3.085433 1.75509
H  -1.274403 1.478166 2.357628
H  3.713591 -3.535072 0.649751
H  -0.432043 -2.822031 0.537685
H  -2.182234 4.03412 -0.118422
H  -2.889498 0.006315 1.140547
H  2.403169 -5.794044 -0.17956
H  -4.180284 3.944337 -1.542875
H  -4.886304 -0.093886 -0.283388
elementType: Cl O N C H
totalener: -1513.52183320 hartree
nucrepener: 2392.94866303 hartree
electener: -3906.47049623 hartree
oneelecener: -6822.55277824 hartree
twoeener: 2916.08228200 hartree
cpcmener: -0.03159940 hartree
kineticenergy: 1508.15883782 hartree
xcener: -124.306046881353 hartree
chargesum: -0.0000000
charge: -0.105380 -0.382889 -0.447724 -0.069223 -0.015109 -0.369988 0.357287 0.134281 0.026946 -0.255479 -0.312330 -0.340040 -0.332968 -0.127956 0.317667 -0.061722 0.032399 -0.150876 0.041462 -0.212051 -0.225473 -0.128899 -0.145758 -0.144448 0.084363 0.114865 0.082781 0.099482 0.092995 0.112896 0.104702 0.104670 0.108180 0.113280 0.114231 0.108069 0.124080 0.106758 0.099954 0.069561 0.089602 0.094771 0.192884 0.168404 0.140144 0.142286 0.164219 0.142262 0.142834
qa: -0.1054 -0.3829 -0.4477 -0.0692 -0.0151 -0.3700 0.3573 0.1343 0.0269 -0.2555 -0.3123 -0.3400 -0.3330 -0.1280 0.3177 -0.0617 0.0324 -0.1509 0.0415 -0.2121 -0.2255 -0.1289 -0.1458 -0.1444 0.0844 0.1149 0.0828 0.0995 0.0930 0.1129 0.1047 0.1047 0.1082 0.1133 0.1142 0.1081 0.1241 0.1068 0.1000 0.0696 0.0896 0.0948 0.1929 0.1684 0.1401 0.1423 0.1642 0.1423 0.1428
va: 1.2001 1.9817 2.0564 3.1312 3.2372 3.1163 3.9527 3.8858 3.9623 3.8504 3.9477 3.9608 3.9432 3.8752 4.2912 3.7941 3.5811 3.9113 4.0391 3.9816 3.9758 4.0367 3.9722 3.9782 3.8276 0.9943 0.9878 1.0183 1.0326 1.0035 1.0042 1.0140 1.0023 1.0023 1.0037 0.9996 1.0041 0.9963 1.0100 1.0165 1.0117 1.0082 0.9794 1.0000 1.0040 1.0040 1.0032 1.0053 1.0051
dispcorr: -0.028748236 hartree
energy: -1513.550581440095
dipole: 33.56742 -31.41664 2.15078 0.40459 1.02819 1.43278 3.30586 -4.16578 -0.85991
magnitude: 2.72363 au
magnitude: 6.92291 debye
