program: Orca
programVersion: 4.2.1
elementType: Cl O O N N N C C C C C C C C C C C C C C C C C C C H H H H H H H H H H H H H H H H H H H H H H H H
charge: 0
multiplicity: 1
keywords: wb97x-d3
keywords: def2-TZVPP
keywords: def2/J RIJCOSX GRIDX6 NOFINALGRIDX
keywords: grid4 nofinalgrid
keywords: scfconv7
keywords: smallprint printgap noloewdin
keywords: NOSOSCF
formula: C19H24ClN3O2
InChI: InChI=1/C19H24ClN3O2/c1-18(2)13-25-19(3,23(18)17(24)22-12-11-21-14-22)10-4-5-15-6-8-16(20)9-7-15/h6-9,11-12,14H,4-5,10,13H2,1-3H3
49 atoms
Cl -5.925966 1.733669 -2.134706
O  3.101179 1.529983 -0.138407
O  1.431289 -1.279895 2.384437
N  2.304953 -0.511764 0.438731
N  1.56565 -2.734315 0.645971
N  1.917495 -4.842238 0.126028
C  2.604138 0.840636 0.986356
C  2.653534 -0.588418 -1.001773
C  2.655339 0.906335 -1.31562
C  1.369044 1.554889 1.555727
C  3.719171 0.798491 2.020365
C  4.04784 -1.170455 -1.212827
C  1.627206 -1.27955 -1.887878
C  0.117013 1.550591 0.68883
C  1.770887 -1.443388 1.231856
C  -1.083864 2.157798 1.418651
C  -2.323461 2.082614 0.574174
C  0.333836 -3.278461 0.380733
C  2.480523 -3.7277 0.495151
C  -2.677074 3.120918 -0.282835
C  -3.114148 0.935723 0.577149
C  0.579441 -4.573118 0.041607
C  -3.78193 3.024605 -1.116519
C  -4.222042 0.818934 -0.248282
C  -4.545404 1.868798 -1.093214
H  3.340689 1.153174 -2.127145
H  1.654668 1.244994 -1.606869
H  1.67698 2.58836 1.741163
H  1.134195 1.132743 2.532262
H  4.596016 0.280416 1.631364
H  3.403443 0.302397 2.935157
H  4.014569 1.815271 2.282442
H  4.314664 -1.112925 -2.269029
H  4.103084 -2.21909 -0.926536
H  4.805815 -0.625284 -0.649689
H  0.606462 -0.995246 -1.629436
H  1.798822 -0.962785 -2.918573
H  1.703879 -2.364539 -1.878599
H  0.282478 2.112851 -0.23318
H  -0.143339 0.531295 0.388314
H  -0.867566 3.197065 1.678597
H  -1.243917 1.624909 2.35978
H  -0.577649 -2.706706 0.435875
H  3.529547 -3.58126 0.698445
H  -2.082572 4.026589 -0.305869
H  -2.866012 0.11266 1.237333
H  -0.136863 -5.323016 -0.25556
H  -4.040571 3.843512 -1.77437
H  -4.823229 -0.080254 -0.229092
elementType: Cl O N C H
totalener: -1513.52126326 hartree
nucrepener: 2398.78700594 hartree
electener: -3912.30826920 hartree
oneelecener: -6834.13522903 hartree
twoeener: 2921.82695984 hartree
cpcmener: -0.03117159 hartree
kineticenergy: 1508.15650856 hartree
xcener: -124.304953216674 hartree
chargesum: -0.0000000
charge: -0.105405 -0.381254 -0.447341 -0.066181 -0.013732 -0.371201 0.358963 0.122897 0.029583 -0.254870 -0.311855 -0.337843 -0.326380 -0.129942 0.312087 -0.062723 0.040886 -0.134052 0.024478 -0.216370 -0.229664 -0.123929 -0.142288 -0.141233 0.081890 0.114951 0.083071 0.099852 0.091141 0.104630 0.104022 0.113011 0.108382 0.112997 0.114093 0.107623 0.124091 0.106310 0.103110 0.066198 0.090490 0.093978 0.177427 0.177639 0.140779 0.141015 0.165351 0.142400 0.142917
qa: -0.1054 -0.3813 -0.4473 -0.0662 -0.0137 -0.3712 0.3590 0.1229 0.0296 -0.2549 -0.3119 -0.3378 -0.3264 -0.1299 0.3121 -0.0627 0.0409 -0.1341 0.0245 -0.2164 -0.2297 -0.1239 -0.1423 -0.1412 0.0819 0.1150 0.0831 0.0999 0.0911 0.1046 0.1040 0.1130 0.1084 0.1130 0.1141 0.1076 0.1241 0.1063 0.1031 0.0662 0.0905 0.0940 0.1774 0.1776 0.1408 0.1410 0.1654 0.1424 0.1429
va: 1.2002 1.9831 2.0564 3.1292 3.2406 3.1139 3.9470 3.9061 3.9585 3.8606 3.9473 3.9598 3.9366 3.8816 4.2918 3.8015 3.5811 3.9019 4.0488 3.9842 3.9772 4.0195 3.9699 3.9736 3.8299 0.9940 0.9882 1.0185 1.0319 1.0043 1.0138 1.0035 1.0022 1.0017 1.0035 0.9998 1.0039 0.9959 1.0081 1.0144 1.0118 1.0088 0.9934 0.9893 1.0040 1.0044 1.0017 1.0051 1.0048
dispcorr: -0.028875118 hartree
energy: -1513.550138374721
dipole: 31.06862 -30.01129 1.05733 1.41381 0.32958 1.74339 3.94717 -4.86733 -0.92016
magnitude: 2.23697 au
magnitude: 5.68592 debye
