program: Orca
programVersion: 4.2.1
elementType: Cl O O N N N C C C C C C C C C C C C C C C C C C C H H H H H H H H H H H H H H H H H H H H H H H H
charge: 0
multiplicity: 1
keywords: wb97x-d3
keywords: def2-TZVPP
keywords: def2/J RIJCOSX GRIDX6 NOFINALGRIDX
keywords: grid4 nofinalgrid
keywords: scfconv7
keywords: smallprint printgap noloewdin
keywords: NOSOSCF
formula: C19H24ClN3O2
InChI: InChI=1/C19H24ClN3O2/c1-18(2)13-25-19(3,23(18)17(24)22-12-11-21-14-22)10-4-5-15-6-8-16(20)9-7-15/h6-9,11-12,14H,4-5,10,13H2,1-3H3
49 atoms
Cl -5.913027 2.512098 -2.216859
O  2.867733 1.432286 0.87811
O  2.010507 -2.172706 -1.561049
N  2.62445 -0.607436 -0.040073
N  1.442163 -2.537901 0.604382
N  -0.129742 -3.713231 1.598738
C  2.470875 0.135163 1.250109
C  3.364356 0.216271 -1.027771
C  3.875018 1.312214 -0.095666
C  1.036969 0.235184 1.767044
C  3.403308 -0.390138 2.33854
C  4.52818 -0.523727 -1.669784
C  2.435614 0.816328 -2.081509
C  0.008296 0.728184 0.759564
C  2.051815 -1.752666 -0.424285
C  -1.387524 0.752238 1.365022
C  -2.490522 1.202268 0.440713
C  2.068684 -3.275417 1.57928
C  0.122441 -2.864077 0.645951
C  -3.801963 1.241317 0.91688
C  -2.269751 1.582068 -0.879175
C  1.07712 -3.986016 2.182601
C  -4.856199 1.640801 0.113842
C  -3.314154 1.985815 -1.702093
C  -4.601599 2.011759 -1.198567
H  4.841161 1.042747 0.349504
H  3.993782 2.269589 -0.602899
H  1.070969 0.925484 2.615441
H  0.729303 -0.721209 2.192133
H  3.035004 -1.310034 2.785141
H  3.469213 0.34956 3.137307
H  4.410563 -0.578659 1.966631
H  4.205443 -1.233377 -2.428314
H  5.120796 -1.057953 -0.925727
H  5.18481 0.199715 -2.156666
H  1.645898 1.415198 -1.626586
H  3.008964 1.472637 -2.738171
H  1.97195 0.053994 -2.703624
H  0.280375 1.729492 0.418675
H  0.003376 0.090624 -0.129248
H  -1.387056 1.399041 2.248169
H  -1.637175 -0.246455 1.738848
H  3.1350 -3.259756 1.72551
H  -0.598213 -2.43435 -0.033016
H  -4.008221 0.951629 1.9407
H  -1.272235 1.571199 -1.298134
H  1.171787 -4.685757 2.998106
H  -5.863649 1.661432 0.507424
H  -3.114861 2.274687 -2.725398
elementType: Cl O N C H
totalener: -1513.52116313 hartree
nucrepener: 2408.75383872 hartree
electener: -3922.27500184 hartree
oneelecener: -6854.27717192 hartree
twoeener: 2932.00217007 hartree
cpcmener: -0.03127624 hartree
kineticenergy: 1508.15110475 hartree
xcener: -124.307008075642 hartree
chargesum: -0.0000000
charge: -0.106161 -0.373671 -0.446627 -0.050236 -0.013994 -0.368888 0.255222 0.132238 0.072335 -0.194279 -0.318831 -0.324540 -0.359104 -0.106678 0.323030 -0.103667 0.043277 -0.153785 0.031040 -0.213297 -0.181554 -0.120888 -0.169346 -0.190745 0.116960 0.081778 0.111385 0.111744 0.090399 0.117311 0.112703 0.110292 0.108100 0.099480 0.115190 0.105507 0.112760 0.115054 0.095949 0.059223 0.099626 0.092810 0.192464 0.166620 0.138504 0.139298 0.165018 0.141349 0.139621
qa: -0.1062 -0.3737 -0.4466 -0.0502 -0.0140 -0.3689 0.2552 0.1322 0.0723 -0.1943 -0.3188 -0.3245 -0.3591 -0.1067 0.3230 -0.1037 0.0433 -0.1538 0.0310 -0.2133 -0.1816 -0.1209 -0.1693 -0.1907 0.1170 0.0818 0.1114 0.1117 0.0904 0.1173 0.1127 0.1103 0.1081 0.0995 0.1152 0.1055 0.1128 0.1151 0.0959 0.0592 0.0996 0.0928 0.1925 0.1666 0.1385 0.1393 0.1650 0.1413 0.1396
va: 1.1993 1.9768 2.0608 3.1396 3.2421 3.1060 4.0692 3.9121 3.9005 3.7569 3.9498 3.9159 3.9236 3.8809 4.2757 3.8308 3.6503 3.9084 4.0354 4.0201 3.9257 4.0372 3.9921 4.0651 3.7976 1.0032 0.9934 1.0208 1.0087 0.9993 1.0113 1.0039 1.0156 1.0040 0.9987 1.0002 1.0033 1.0174 1.0169 1.0028 1.0012 1.0040 0.9799 0.9988 1.0040 1.0036 1.0021 1.0060 1.0089
dispcorr: -0.029507347 hartree
energy: -1513.550670475216
dipole: 35.73416 -32.88601 2.84815 -1.41469 2.85640 1.44171 9.81346 -8.65560 1.15786
magnitude: 3.39575 au
magnitude: 8.63131 debye
