program: Orca
programVersion: 4.2.1
elementType: Cl O O N N N C C C C C C C C C C C C C C C C C C C H H H H H H H H H H H H H H H H H H H H H H H H
charge: 0
multiplicity: 1
keywords: wb97x-d3
keywords: def2-TZVPP
keywords: def2/J RIJCOSX GRIDX6 NOFINALGRIDX
keywords: grid4 nofinalgrid
keywords: scfconv7
keywords: smallprint printgap noloewdin
keywords: NOSOSCF
formula: C19H24ClN3O2
InChI: InChI=1/C19H24ClN3O2/c1-18(2)13-25-19(3,23(18)17(24)22-12-11-21-14-22)10-4-5-15-6-8-16(20)9-7-15/h6-9,11-12,14H,4-5,10,13H2,1-3H3
49 atoms
Cl -6.168773 0.809931 0.418931
O  2.844331 1.403602 0.779744
O  0.018028 -1.59095 0.467581
N  2.058664 -0.634422 0.209771
N  1.667846 -2.861071 -0.43284
N  1.742303 -4.583261 -1.799137
C  1.654384 0.656878 0.844476
C  3.417481 -0.518186 -0.378131
C  3.531087 1.007012 -0.379224
C  0.542405 1.343607 0.036558
C  1.304488 0.486557 2.312529
C  4.490506 -1.106573 0.534471
C  3.555634 -1.045299 -1.798824
C  0.280495 2.784657 0.457345
C  1.180376 -1.637333 0.123566
C  -0.812083 3.446032 -0.389038
C  -2.160852 2.806519 -0.212177
C  2.497605 -3.783501 0.154148
C  1.225156 -3.406412 -1.595863
C  -2.676067 1.920643 -1.153952
C  -2.917254 3.06015 0.930579
C  2.531332 -4.834339 -0.710885
C  -3.904498 1.301417 -0.970068
C  -4.146691 2.453306 1.133392
C  -4.630878 1.574102 0.176794
H  4.565022 1.345864 -0.313803
H  3.088829 1.438168 -1.287017
H  -0.372766 0.761832 0.135386
H  0.802486 1.324277 -1.027071
H  1.271764 1.458768 2.80438
H  2.055771 -0.117692 2.821889
H  0.332834 0.017256 2.445415
H  4.435149 -2.191274 0.589473
H  4.424496 -0.708997 1.547612
H  5.478284 -0.859042 0.142657
H  2.708456 -0.763034 -2.424719
H  4.449756 -0.604225 -2.243799
H  3.68644 -2.124886 -1.84565
H  -0.014419 2.830246 1.509512
H  1.192216 3.378079 0.36385
H  -0.523408 3.416485 -1.442982
H  -0.871953 4.502105 -0.115014
H  2.937366 -3.637495 1.125436
H  0.547868 -2.883384 -2.25324
H  -2.112767 1.704336 -2.053825
H  -2.546086 3.748923 1.680629
H  3.073301 -5.760401 -0.600239
H  -4.285638 0.615958 -1.715092
H  -4.720146 2.666927 2.025482
elementType: Cl O N C H
totalener: -1513.52275011 hartree
nucrepener: 2392.42222582 hartree
electener: -3905.94497593 hartree
oneelecener: -6822.04943845 hartree
twoeener: 2916.10446252 hartree
cpcmener: -0.03334009 hartree
kineticenergy: 1508.15898411 hartree
xcener: -124.306274098449 hartree
chargesum: 0.0000000
charge: -0.105703 -0.387509 -0.456992 -0.067865 -0.033528 -0.371696 0.355362 0.107990 0.055509 -0.254448 -0.318026 -0.341036 -0.332336 -0.136001 0.368771 -0.102365 0.037248 -0.153121 0.035854 -0.203714 -0.215036 -0.128072 -0.132202 -0.148322 0.084080 0.114392 0.085103 0.106189 0.089073 0.110501 0.107038 0.107887 0.112972 0.112067 0.106355 0.109955 0.120264 0.103297 0.082871 0.085803 0.090312 0.102295 0.192766 0.174319 0.139002 0.140932 0.164649 0.142811 0.142303
qa: -0.1057 -0.3875 -0.4570 -0.0679 -0.0335 -0.3717 0.3554 0.1080 0.0555 -0.2544 -0.3180 -0.3410 -0.3323 -0.1360 0.3688 -0.1024 0.0372 -0.1531 0.0359 -0.2037 -0.2150 -0.1281 -0.1322 -0.1483 0.0841 0.1144 0.0851 0.1062 0.0891 0.1105 0.1070 0.1079 0.1130 0.1121 0.1064 0.1100 0.1203 0.1033 0.0829 0.0858 0.0903 0.1023 0.1928 0.1743 0.1390 0.1409 0.1646 0.1428 0.1423
va: 1.1994 1.9667 2.0562 3.1615 3.2570 3.1143 4.0485 3.9307 3.9336 3.8658 3.9308 3.9516 3.9481 3.8606 4.2596 3.8309 3.5667 3.9146 4.0409 3.9388 3.9825 4.0416 3.9766 3.9768 3.8317 0.9908 1.0005 1.0350 1.0092 1.0027 1.0066 1.0152 1.0026 1.0068 1.0032 1.0016 1.0044 0.9958 1.0065 1.0305 1.0107 1.0053 0.9789 0.9977 1.0029 1.0025 1.0030 1.0041 1.0050
dispcorr: -0.028444594 hartree
energy: -1513.551194702687
dipole: 36.52714 -33.75167 2.77547 7.81145 -5.64864 2.16281 -0.42724 0.52746 0.10022
magnitude: 3.52009 au
magnitude: 8.94735 debye
