program: Gaussian 09
title: 000068332
version: EM64L-G09RevD.01
frameworkgroup: C1[X(C9H18F2N2O)]
method: RPBEPBE
basis: SDD
operation: Freq
keyword: #p
keyword: freq=noraman
keyword: PBEPBE/SDD
title: #p freq=noraman PBEPBE/SDD
converged: YES YES NO NO
title: Mulliken charges:
elementType: F F O N N C C C C C C C C C H H H H H H H H H H H H H H H H H H
charge: -0.252901 -0.248620 -0.309189 -0.405079 -0.411024 -0.347190 -0.337629 -0.401246 -0.385735 -0.389734 -0.388427 0.309903 -0.214395 -0.213635 0.237075 0.224214 0.192876 0.243064 0.258049 0.205600 0.265320 0.199501 0.205350 0.208061 0.191537 0.212436 0.280935 0.277277 0.199065 0.199470 0.194651 0.200424
chargesum: 0.00000
title: Mulliken charges with hydrogens summed into heavy atoms:
elementType: F F O N N C C C C C C C C C
charge: -0.252901 -0.248620 -0.309189 -0.124145 -0.133747 0.114098 0.098311 0.062402 0.079086 0.023677 0.015546 0.309903 0.184140 0.181439
polarizability: 1.39304315e+02 -7.12006763e-01 1.05441628e+02 -1.34545221e-02 3.43845757e+00 1.00999036e+02
1716.lowfreq: -15.8741 -7.2579 -1.7451 -0.0004 0.0005 0.0007 7.3789 23.0908 35.2351
frequency: -3.0638 19.8960 35.1155 42.5086 52.5993 62.6719 89.6792 113.0682 132.7754 154.4896 181.4418 224.8571 252.4883 255.5314 265.0247 276.3155 343.8179 380.0708 430.2760 482.8858 492.8276 533.7148 543.3020 649.8817 710.5400 754.1197 755.4833 804.3369 827.7385 849.2033 851.3039 888.9118 924.4430 955.6062 974.7728 985.6504 1033.5964 1048.5046 1081.1812 1099.1333 1105.8974 1106.8297 1120.8173 1161.3797 1169.6156 1174.9213 1198.0604 1207.3502 1229.8384 1269.0604 1273.5270 1283.7169 1290.9761 1319.0025 1325.9524 1358.0904 1360.0542 1369.3391 1373.2436 1376.6903 1380.9140 1438.7533 1441.4377 1446.7201 1451.0768 1462.5747 1465.0347 1469.1171 1469.5527 1472.6841 1503.7840 1631.4724 2965.8826 2971.1539 2977.6732 2982.5843 2995.7833 2999.3155 3001.3967 3004.3129 3025.1898 3025.4132 3059.7444 3061.6425 3071.8318 3074.6213 3074.9169 3078.8267 3554.8156 3563.2571
redmass: 5.7785 4.6860 5.3430 3.3846 6.8070 3.6044 4.2200 4.8278 2.7050 2.6206 3.7068 2.7374 1.4643 1.6697 2.2006 2.5093 2.6413 2.9638 3.2443 1.3377 2.3058 2.3632 2.6186 3.6523 6.3654 1.5395 1.4519 2.1123 2.4820 2.7528 2.2537 2.6205 2.3328 1.7006 1.7646 2.4714 2.7062 2.3770 3.2972 2.2343 2.1546 2.2549 1.9865 1.5389 1.2588 1.7500 1.2825 1.3401 1.6261 1.3015 1.3185 1.1661 1.1351 1.2443 1.2509 1.3424 1.4019 1.3788 1.3220 1.2791 1.3583 1.2606 1.0867 1.0857 1.1254 1.2553 1.0919 1.0920 1.0937 1.0934 2.2416 5.1526 1.0602 1.0590 1.0659 1.0659 1.0593 1.0630 1.0597 1.0611 1.0933 1.0946 1.1010 1.0983 1.1042 1.1052 1.1033 1.1108 1.0778 1.0770
irintensity: 0.8698 3.2150 7.1878 2.3046 13.0579 7.8357 1.6277 9.9466 1.9411 3.1939 0.4883 5.9632 2.8834 6.7461 1.4859 3.6747 22.3830 4.0314 1.0001 247.7135 30.8738 0.6405 4.1197 3.0639 9.2337 3.3303 6.1723 6.8568 0.7389 59.9251 0.7782 19.5391 29.4591 2.9973 2.9576 12.2816 35.1698 12.7725 11.6805 11.7315 2.1861 2.2380 6.5646 4.7642 18.7869 7.8364 18.9051 13.7112 133.4885 3.1480 102.6451 0.9757 4.4841 39.7916 18.6491 2.2314 1.4511 7.3988 12.6547 5.6456 1.4885 42.7148 6.6476 2.5417 23.3947 18.0052 14.0743 3.8910 4.5206 15.6208 530.8367 160.6835 18.3148 17.1466 43.6334 54.5217 22.0026 49.7059 42.6929 36.2954 41.4344 10.3043 50.0881 43.2487 12.6469 41.9370 17.7784 62.6208 6.8650 9.7052
temp: 298.150 k
press: 1.00000 atm
elementType: 9 9 8 7 7 6 6 6 6 6 6 6 6 6 1 1 1 1 1 1 1 1 1 1 1 1 1 1 1 1 1 1
symmnumber: 1
zpe: 710316.3 jmol-1
zpe.correction: 0.270545 hartree
zpe.thermalcorrener: 0.286643 hartree
zpe.thermalcorrenthalpy: 0.287588 hartree
zpe.thermalcorrgfe: 0.223852 hartree
zpe.sumelectzpe: -737.037393 hartree
zpe.sumelectthermal: -737.021295 hartree
zpe.sumelectthermalent: -737.020350 hartree
zpe.sumelectthermalfe: -737.084086 hartree
dipole: -4.4486 -0.3712 5.0217
dipole: 6.7190
quadrupole: -83.9173 -93.9668 -81.6829
quadrupole: -1.8848 0.9492 -4.0581
quadrupole: 2.6050 -7.4445 4.8395 -1.8848 0.9492 -4.0581
hfenergy: -737.3079379 hartree
pointgroup: C01 [X(C9H18F2N2O1)]
dipole: -1.667765 0.0924242 -2.048866 debye
polarizability: 139.0974329|2.1712423|105.4809235|1.5365287|3.6012237|101.1666228 unknown
InChI: InChI=1S/C9H18F2N2O/c10-5-1-3-7-12-9(14)13-8-4-2-6-11/h12-13H,1-8H2
charge 0 multiplicity 1
32 atoms
F  5.110955 -1.613977 0.469703
F  -2.874709 -2.989439 -0.000004
O  -0.011462 1.890804 1.210746
N  0.995753 1.524911 -0.866301
N  -1.350697 1.40827 -0.652494
C  2.944428 0.492424 0.380437
C  -3.141864 0.003964 0.446777
C  2.356249 1.729666 -0.336401
C  -2.600169 1.417143 0.122453
C  3.049867 -0.752147 -0.525106
C  -3.576031 -0.790478 -0.803805
C  -0.115783 1.621063 -0.027557
C  3.707558 -1.942402 0.167012
C  -4.025398 -2.216112 -0.491018
H  2.312884 0.268879 1.261306
H  3.951664 0.753449 0.759174
H  -4.00678 0.111678 1.133336
H  -2.363331 -0.56045 0.992026
H  2.316888 2.570127 0.378792
H  3.006079 2.02838 -1.18132
H  -2.37451 1.948546 1.06299
H  -3.364253 2.002652 -0.427743
H  2.03542 -1.066216 -0.847274
H  3.625164 -0.513343 -1.442552
H  -4.416779 -0.269947 -1.31029
H  -2.740876 -0.84236 -1.530117
H  0.883635 1.267522 -1.846723
H  -1.393584 1.226937 -1.655359
H  3.225675 -2.176674 1.134629
H  3.734012 -2.840016 -0.477677
H  -4.786978 -2.244928 0.311002
H  -4.393527 -2.745027 -1.389341
