program: Orca
programVersion: 4.2.1
elementType: Cl O O N N N C C C C C C C C C C C C C C C C C C C H H H H H H H H H H H H H H H H H H H H H H H H
charge: 0
multiplicity: 1
keywords: wb97x-d3
keywords: def2-TZVPP
keywords: def2/J RIJCOSX GRIDX6 NOFINALGRIDX
keywords: grid4 nofinalgrid
keywords: scfconv7
keywords: smallprint printgap noloewdin
keywords: NOSOSCF
formula: C19H24ClN3O2
InChI: InChI=1/C19H24ClN3O2/c1-18(2)13-25-19(3,23(18)17(24)22-12-11-21-14-22)10-4-5-15-6-8-16(20)9-7-15/h6-9,11-12,14H,4-5,10,13H2,1-3H3
49 atoms
Cl -4.83698 1.214301 -2.524376
O  1.939034 1.492464 -0.518042
O  1.980717 -1.347358 2.494093
N  1.883357 -0.593882 0.355513
N  1.719669 -2.882043 0.842864
N  2.16192 -5.026131 0.630456
C  1.861182 0.851548 0.733932
C  2.027729 -0.73772 -1.116847
C  2.61869 0.639885 -1.402923
C  0.517059 1.211076 1.362957
C  3.059305 1.259032 1.584682
C  2.995644 -1.818023 -1.574635
C  0.677747 -0.877506 -1.816069
C  0.281053 2.706216 1.544995
C  1.875386 -1.536805 1.300376
C  -1.176315 3.014773 1.909128
C  -2.13621 2.593649 0.830662
C  0.574046 -3.466639 0.363239
C  2.634124 -3.872581 1.006095
C  -2.181918 3.278747 -0.382262
C  -2.957067 1.480338 0.983145
C  0.872443 -4.789234 0.2414
C  -3.008129 2.865865 -1.415318
C  -3.792675 1.049997 -0.038328
C  -3.80671 1.747008 -1.23412
H  3.703902 0.646082 -1.22895
H  2.436157 0.97021 -2.426413
H  0.425417 0.713373 2.329808
H  -0.263553 0.794013 0.721788
H  3.996834 0.901596 1.156518
H  2.992046 0.891116 2.603793
H  3.110993 2.347443 1.627124
H  2.554514 -2.81312 -1.588683
H  3.904399 -1.838393 -0.972117
H  3.292551 -1.594899 -2.601442
H  -0.013717 -0.083066 -1.533683
H  0.819282 -0.82284 -2.896789
H  0.203306 -1.833722 -1.605228
H  0.924724 3.099713 2.33564
H  0.539158 3.250443 0.633667
H  -1.27081 4.08844 2.089671
H  -1.434065 2.517856 2.847919
H  -0.336255 -2.915598 0.202886
H  3.627328 -3.678187 1.379626
H  -1.558139 4.15213 -0.532361
H  -2.944764 0.926924 1.914558
H  0.224325 -5.580157 -0.102107
H  -3.026101 3.411072 -2.34955
H  -4.418504 0.178762 0.101531
elementType: Cl O N C H
totalener: -1513.52157278 hartree
nucrepener: 2431.88476912 hartree
electener: -3945.40634190 hartree
oneelecener: -6900.61436960 hartree
twoeener: 2955.20802770 hartree
cpcmener: -0.03104575 hartree
kineticenergy: 1508.15857889 hartree
xcener: -124.305906843408 hartree
chargesum: -0.0000000
charge: -0.106776 -0.373700 -0.459278 -0.070364 -0.030803 -0.372067 0.305887 0.128095 0.058081 -0.202745 -0.324645 -0.334215 -0.348070 -0.131286 0.360100 -0.094148 0.021883 -0.150833 0.036701 -0.211736 -0.181716 -0.128174 -0.153558 -0.147836 0.095638 0.084584 0.108913 0.105853 0.068059 0.104098 0.112967 0.106658 0.103026 0.112005 0.120827 0.105337 0.111059 0.114898 0.087471 0.084670 0.104035 0.087337 0.187919 0.175398 0.138436 0.140804 0.165324 0.142797 0.143089
qa: -0.1068 -0.3737 -0.4593 -0.0704 -0.0308 -0.3721 0.3059 0.1281 0.0581 -0.2027 -0.3246 -0.3342 -0.3481 -0.1313 0.3601 -0.0941 0.0219 -0.1508 0.0367 -0.2117 -0.1817 -0.1282 -0.1536 -0.1478 0.0956 0.0846 0.1089 0.1059 0.0681 0.1041 0.1130 0.1067 0.1030 0.1120 0.1208 0.1053 0.1111 0.1149 0.0875 0.0847 0.1040 0.0873 0.1879 0.1754 0.1384 0.1408 0.1653 0.1428 0.1431
va: 1.1985 1.9644 2.0527 3.1333 3.2529 3.1143 4.0466 3.9079 3.9420 3.8256 3.9518 3.9413 3.9572 3.8433 4.2660 3.8488 3.5893 3.9158 4.0386 3.9849 3.9116 4.0455 3.9835 3.9785 3.8233 1.0026 0.9920 1.0289 1.0250 1.0055 1.0200 1.0044 0.9958 1.0020 1.0043 1.0028 1.0041 1.0018 1.0119 1.0272 1.0039 1.0100 0.9816 0.9973 1.0038 1.0030 1.0029 1.0048 1.0042
dispcorr: -0.029106800 hartree
energy: -1513.550679580508
dipole: 22.94048 -22.35494 0.58554 5.49872 -3.53980 1.95893 5.14342 -6.15183 -1.00841
magnitude: 2.27972 au
magnitude: 5.79460 debye
