program: Orca
programVersion: 4.2.1
elementType: Cl O O N N N C C C C C C C C C C C C C C C C C C C H H H H H H H H H H H H H H H H H H H H H H H H
charge: 0
multiplicity: 1
keywords: wb97x-d3
keywords: def2-TZVPP
keywords: def2/J RIJCOSX GRIDX6 NOFINALGRIDX
keywords: grid4 nofinalgrid
keywords: scfconv7
keywords: smallprint printgap noloewdin
keywords: NOSOSCF
formula: C19H24ClN3O2
InChI: InChI=1/C19H24ClN3O2/c1-18(2)13-25-19(3,23(18)17(24)22-12-11-21-14-22)10-4-5-15-6-8-16(20)9-7-15/h6-9,11-12,14H,4-5,10,13H2,1-3H3
49 atoms
Cl -4.669899 1.227588 -2.674344
O  2.525229 1.553923 0.52065
O  1.848457 -2.27294 -1.601215
N  2.32566 -0.578289 -0.171974
N  0.88034 -2.329948 0.448708
N  0.23636 -3.564484 2.151354
C  2.007058 0.329895 0.97726
C  3.251801 0.093599 -1.116462
C  3.669556 1.276541 -0.247846
C  0.505822 0.514708 1.196784
C  2.731697 -0.090084 2.252983
C  4.459125 -0.756116 -1.481773
C  2.518663 0.597616 -2.359111
C  0.135779 1.773716 1.97506
C  1.727698 -1.719703 -0.528828
C  -1.357365 1.799898 2.322327
C  -2.234168 1.67036 1.108788
C  -0.463268 -2.554483 0.277069
C  1.251624 -2.981279 1.582927
C  -2.867765 0.469681 0.801739
C  -2.38041 2.734817 0.221832
C  -0.841762 -3.298281 1.351086
C  -3.619878 0.323369 -0.355377
C  -3.127078 2.609791 -0.939335
C  -3.739918 1.398139 -1.220365
H  4.533418 1.029381 0.381548
H  3.923876 2.158077 -0.83556
H  0.112004 -0.347183 1.736655
H  0.007497 0.533961 0.224365
H  3.776276 -0.341718 2.070985
H  2.262311 -0.947634 2.727369
H  2.706227 0.726552 2.974313
H  4.214516 -1.545619 -2.188554
H  4.908068 -1.21036 -0.597908
H  5.215927 -0.12194 -1.94721
H  1.682595 1.246035 -2.092713
H  3.20531 1.178491 -2.97687
H  2.137602 -0.217112 -2.971039
H  0.698793 1.833114 2.909652
H  0.388749 2.665995 1.399454
H  -1.577687 2.734679 2.843552
H  -1.580727 0.992493 3.024151
H  -1.014285 -2.151058 -0.555931
H  2.275864 -3.016974 1.919317
H  -2.771698 -0.375697 1.472625
H  -1.902606 3.683945 0.435445
H  -1.831407 -3.654358 1.591163
H  -4.102539 -0.619489 -0.575804
H  -3.228558 3.448277 -1.615378
elementType: Cl O N C H
totalener: -1513.52049675 hartree
nucrepener: 2468.87467977 hartree
electener: -3982.39517652 hartree
oneelecener: -6974.62135146 hartree
twoeener: 2992.22617495 hartree
cpcmener: -0.03085845 hartree
kineticenergy: 1508.16519041 hartree
xcener: -124.307330395907 hartree
chargesum: -0.0000000
charge: -0.104968 -0.360496 -0.456094 -0.043568 -0.025795 -0.372626 0.197503 0.138625 0.075162 -0.155472 -0.324435 -0.322842 -0.355199 -0.146894 0.365434 -0.099543 0.041817 -0.147068 0.023169 -0.193745 -0.204867 -0.116734 -0.157093 -0.147529 0.099008 0.081751 0.107737 0.078970 0.099289 0.109631 0.117486 0.111505 0.108241 0.099686 0.113159 0.106508 0.105481 0.109017 0.089685 0.080792 0.101493 0.089824 0.176833 0.181142 0.136960 0.139618 0.164347 0.142633 0.142461
qa: -0.1050 -0.3605 -0.4561 -0.0436 -0.0258 -0.3726 0.1975 0.1386 0.0752 -0.1555 -0.3244 -0.3228 -0.3552 -0.1469 0.3654 -0.0995 0.0418 -0.1471 0.0232 -0.1937 -0.2049 -0.1167 -0.1571 -0.1475 0.0990 0.0818 0.1077 0.0790 0.0993 0.1096 0.1175 0.1115 0.1082 0.0997 0.1132 0.1065 0.1055 0.1090 0.0897 0.0808 0.1015 0.0898 0.1768 0.1811 0.1370 0.1396 0.1643 0.1426 0.1425
va: 1.2009 1.9703 2.0537 3.1332 3.2522 3.1073 4.1215 3.9205 3.9000 3.8184 3.9695 3.9097 3.9264 3.9011 4.2541 3.8281 3.5612 3.9032 4.0373 3.9208 3.9777 4.0192 3.9792 3.9767 3.8186 1.0027 0.9938 1.0020 1.0091 1.0043 0.9994 1.0074 1.0155 1.0046 0.9994 1.0067 1.0019 1.0185 1.0174 1.0245 1.0066 1.0096 0.9984 0.9880 1.0056 1.0036 1.0020 1.0053 1.0049
dispcorr: -0.030277453 hartree
energy: -1513.550774201581
dipole: 29.11568 -27.38861 1.72707 5.54522 -3.42304 2.12218 12.29035 -11.47929 0.81106
magnitude: 2.85381 au
magnitude: 7.25382 debye
