program: Orca
programVersion: 4.2.1
elementType: Cl O O N N N C C C C C C C C C C C C C C C C C C C H H H H H H H H H H H H H H H H H H H H H H H H
charge: 0
multiplicity: 1
keywords: wb97x-d3
keywords: def2-TZVPP
keywords: def2/J RIJCOSX GRIDX6 NOFINALGRIDX
keywords: grid4 nofinalgrid
keywords: scfconv7
keywords: smallprint printgap noloewdin
keywords: NOSOSCF
formula: C19H24ClN3O2
InChI: InChI=1/C19H24ClN3O2/c1-18(2)13-25-19(3,23(18)17(24)22-12-11-21-14-22)10-4-5-15-6-8-16(20)9-7-15/h6-9,11-12,14H,4-5,10,13H2,1-3H3
49 atoms
Cl -4.496472 -1.246065 -0.204318
O  3.348859 1.636575 0.312424
O  0.359374 -0.721389 1.900932
N  1.856526 -0.047386 0.328859
N  0.349445 -1.802409 -0.087649
N  -0.434957 -3.767635 -0.692433
C  2.314287 1.134254 1.118475
C  2.854767 -0.390649 -0.722981
C  3.993299 0.533799 -0.27167
C  1.231399 2.199159 1.242643
C  2.861083 0.751801 2.493478
C  3.322646 -1.838755 -0.682953
C  2.419996 -0.006158 -2.132893
C  0.767266 2.82491 -0.069372
C  0.861631 -0.812054 0.801577
C  -0.658511 3.38828 0.018817
C  -1.68445 2.290652 -0.017115
C  -0.307195 -1.607518 -1.278345
C  0.214787 -3.118598 0.228583
C  -2.099929 1.764917 -1.240104
C  -2.189246 1.714743 1.144721
C  -0.778735 -2.833105 -1.631893
C  -2.971069 0.689652 -1.308215
C  -3.053867 0.629821 1.098467
C  -3.432177 0.120998 -0.131327
H  4.657869 0.025076 0.439059
H  4.600185 0.879376 -1.109008
H  1.613731 2.984037 1.901629
H  0.394083 1.755259 1.780572
H  3.543223 -0.098151 2.449902
H  2.068975 0.505172 3.194666
H  3.410948 1.602428 2.898713
H  2.619885 -2.528811 -1.146909
H  3.525811 -2.174188 0.335118
H  4.255952 -1.918301 -1.243912
H  2.111946 1.037328 -2.1974
H  3.262115 -0.142139 -2.813509
H  1.61101 -0.629315 -2.50604
H  1.451806 3.623373 -0.36097
H  0.789552 2.092898 -0.880042
H  -0.82339 4.066837 -0.821004
H  -0.769013 3.985703 0.927763
H  -0.42349 -0.636292 -1.725011
H  0.639145 -3.53655 1.128278
H  -1.734587 2.198529 -2.164062
H  -1.906605 2.111495 2.11234
H  -1.35751 -3.087152 -2.505978
H  -3.277284 0.296847 -2.268564
H  -3.422974 0.191771 2.015951
elementType: Cl O N C H
totalener: -1513.51856408 hartree
nucrepener: 2568.28217757 hartree
electener: -4081.80074166 hartree
oneelecener: -7174.19464680 hartree
twoeener: 3092.39390514 hartree
cpcmener: -0.03036947 hartree
kineticenergy: 1508.16064500 hartree
xcener: -124.308950560314 hartree
chargesum: -0.0000000
charge: -0.111181 -0.381770 -0.443448 -0.022037 0.024570 -0.367071 0.255323 0.102399 0.088516 -0.201865 -0.320419 -0.344582 -0.372043 -0.114728 0.322344 -0.109978 0.114302 -0.195148 0.027492 -0.265726 -0.213335 -0.111400 -0.180793 -0.144539 0.138554 0.083255 0.109077 0.105021 0.096848 0.100251 0.110381 0.108247 0.105579 0.112991 0.120669 0.124281 0.117106 0.117097 0.086853 0.050077 0.096661 0.091201 0.192734 0.169783 0.141229 0.144498 0.161121 0.143447 0.138156
qa: -0.1112 -0.3818 -0.4434 -0.0220 0.0246 -0.3671 0.2553 0.1024 0.0885 -0.2019 -0.3204 -0.3446 -0.3720 -0.1147 0.3223 -0.1100 0.1143 -0.1951 0.0275 -0.2657 -0.2133 -0.1114 -0.1808 -0.1445 0.1386 0.0833 0.1091 0.1050 0.0968 0.1003 0.1104 0.1082 0.1056 0.1130 0.1207 0.1243 0.1171 0.1171 0.0869 0.0501 0.0967 0.0912 0.1927 0.1698 0.1412 0.1445 0.1611 0.1434 0.1382
va: 1.1912 1.9719 2.0562 3.1224 3.2191 3.1244 4.1085 3.9040 3.8786 3.7337 3.9424 3.9565 3.9323 3.9068 4.2461 3.8871 3.5113 3.9346 4.0539 3.9262 3.9393 4.0661 3.9270 4.0005 3.7339 1.0025 0.9925 1.0175 1.0315 1.0034 1.0184 1.0107 0.9969 0.9998 1.0028 0.9948 1.0036 1.0039 1.0190 1.0219 1.0059 1.0071 0.9746 1.0015 1.0021 0.9958 1.0059 1.0038 1.0070
dispcorr: -0.033871728 hartree
energy: -1513.552435810814
dipole: 31.52748 -28.94341 2.58407 13.84436 -11.81122 2.03314 -2.28180 1.42482 -0.85699
magnitude: 3.39787 au
magnitude: 8.63671 debye
