program: Orca
programVersion: 4.2.1
elementType: Cl O O N N N C C C C C C C C C C C C C C C C C C C H H H H H H H H H H H H H H H H H H H H H H H H
charge: 0
multiplicity: 1
keywords: wb97x-d3
keywords: def2-TZVPP
keywords: def2/J RIJCOSX GRIDX6 NOFINALGRIDX
keywords: grid4 nofinalgrid
keywords: scfconv7
keywords: smallprint printgap noloewdin
keywords: NOSOSCF
formula: C19H24ClN3O2
InChI: InChI=1/C19H24ClN3O2/c1-18(2)13-25-19(3,23(18)17(24)22-12-11-21-14-22)10-4-5-15-6-8-16(20)9-7-15/h6-9,11-12,14H,4-5,10,13H2,1-3H3
49 atoms
Cl -5.479641 -0.762155 -0.040704
O  3.242659 1.465083 1.005199
O  1.926188 -1.54517 -1.948043
N  2.529989 -0.344739 -0.123151
N  0.511268 -1.563275 -0.181491
N  -1.626634 -2.078764 -0.044404
C  2.230343 0.491522 1.0816
C  3.871878 -0.009083 -0.662239
C  4.393651 0.839054 0.495766
C  0.889834 1.219187 1.04066
C  2.375495 -0.283101 2.391454
C  4.749397 -1.234747 -0.865353
C  3.795653 0.838965 -1.930686
C  0.624884 2.070049 -0.192424
C  1.715095 -1.144083 -0.822031
C  -0.677878 2.87156 -0.079786
C  -1.904626 2.003822 -0.060647
C  0.374967 -2.366145 0.927601
C  -0.727411 -1.450999 -0.739964
C  -2.494026 1.584669 -1.251047
C  -2.459831 1.557422 1.135422
C  -0.950693 -2.664136 0.991548
C  -3.594299 0.741335 -1.255924
C  -3.555748 0.708267 1.151906
C  -4.111936 0.30347 -0.048654
H  4.88914 0.220883 1.255471
H  5.09973 1.60266 0.169719
H  0.875759 1.862904 1.926598
H  0.084094 0.501441 1.197377
H  3.224309 -0.967021 2.382339
H  1.483258 -0.856583 2.628089
H  2.521848 0.427407 3.205942
H  4.726169 -1.890393 0.006346
H  5.783133 -0.914818 -1.009793
H  4.462938 -1.814743 -1.740301
H  4.80433 1.130058 -2.228759
H  3.350179 0.298714 -2.762478
H  3.223386 1.753242 -1.769299
H  1.445408 2.774851 -0.339489
H  0.581571 1.454348 -1.095476
H  -0.733219 3.561741 -0.924567
H  -0.642909 3.488687 0.822231
H  1.212043 -2.689786 1.520698
H  -0.900308 -0.876934 -1.63656
H  -2.090815 1.922479 -2.198924
H  -2.034411 1.877022 2.07947
H  -1.449831 -3.278622 1.724844
H  -4.037292 0.429188 -2.192284
H  -3.96675 0.369313 2.093394
elementType: Cl O N C H
totalener: -1513.51891347 hartree
nucrepener: 2523.28036712 hartree
electener: -4036.79928059 hartree
oneelecener: -7084.38232952 hartree
twoeener: 3047.58304893 hartree
cpcmener: -0.02967669 hartree
kineticenergy: 1508.16062000 hartree
xcener: -124.309053276227 hartree
chargesum: 0.0000000
charge: -0.114106 -0.368886 -0.454302 -0.043205 -0.008641 -0.346428 0.215947 0.130646 0.075368 -0.161913 -0.328673 -0.324281 -0.357227 -0.139836 0.326756 -0.112801 0.120285 -0.165618 0.030874 -0.302105 -0.220802 -0.111201 -0.125622 -0.158712 0.137991 0.082088 0.109560 0.110728 0.076792 0.110979 0.113929 0.115103 0.098888 0.114763 0.107441 0.108827 0.112089 0.111586 0.084787 0.079335 0.098126 0.093833 0.193816 0.162776 0.139328 0.145709 0.160758 0.138733 0.136518
qa: -0.1141 -0.3689 -0.4543 -0.0432 -0.0086 -0.3464 0.2159 0.1306 0.0754 -0.1619 -0.3287 -0.3243 -0.3572 -0.1398 0.3268 -0.1128 0.1203 -0.1656 0.0309 -0.3021 -0.2208 -0.1112 -0.1256 -0.1587 0.1380 0.0821 0.1096 0.1107 0.0768 0.1110 0.1139 0.1151 0.0989 0.1148 0.1074 0.1088 0.1121 0.1116 0.0848 0.0793 0.0981 0.0938 0.1938 0.1628 0.1393 0.1457 0.1608 0.1387 0.1365
va: 1.1894 1.9787 2.0526 3.1208 3.2476 3.0865 4.1554 3.9166 3.8952 3.7151 3.9366 3.9178 3.9219 3.9035 4.2710 3.8475 3.4484 3.8916 4.0182 3.9668 3.9369 4.0048 3.9389 3.9977 3.7516 1.0032 0.9939 1.0198 1.0115 1.0027 1.0006 1.0128 1.0044 0.9988 1.0151 1.0025 1.0200 0.9988 1.0315 1.0094 1.0061 1.0099 0.9799 1.0018 1.0041 0.9966 0.9987 1.0048 1.0064
dispcorr: -0.033114884 hartree
energy: -1513.552028355899
dipole: 37.67138 -34.68815 2.98323 10.78391 -9.35572 1.42819 3.11188 -1.71268 1.39920
magnitude: 3.59126 au
magnitude: 9.12826 debye
