program: Orca
programVersion: 4.2.1
elementType: Cl O O N N N C C C C C C C C C C C C C C C C C C C H H H H H H H H H H H H H H H H H H H H H H H H
charge: 0
multiplicity: 1
keywords: wb97x-d3
keywords: def2-TZVPP
keywords: def2/J RIJCOSX GRIDX6 NOFINALGRIDX
keywords: grid4 nofinalgrid
keywords: scfconv7
keywords: smallprint printgap noloewdin
keywords: NOSOSCF
formula: C19H24ClN3O2
InChI: InChI=1/C19H24ClN3O2/c1-18(2)13-25-19(3,23(18)17(24)22-12-11-21-14-22)10-4-5-15-6-8-16(20)9-7-15/h6-9,11-12,14H,4-5,10,13H2,1-3H3
49 atoms
Cl -5.149432 4.738694 0.729081
O  1.580341 1.34267 0.09466
O  1.261366 -2.423066 1.735189
N  1.974504 -0.868429 0.238789
N  2.511127 -3.140162 -0.017918
N  2.858979 -4.624454 -1.61228
C  1.177157 0.231484 0.852453
C  3.038324 -0.312341 -0.634345
C  2.930427 1.160477 -0.214191
C  -0.325884 0.047508 0.667415
C  1.517072 0.45775 2.327242
C  4.43336 -0.842846 -0.329942
C  2.726172 -0.428411 -2.12579
C  -0.78342 -0.178065 -0.765382
C  1.866107 -2.1173 0.737106
C  -2.304748 -0.319454 -0.878162
C  -3.042616 0.928367 -0.479728
C  3.366914 -4.080134 0.502438
C  2.223779 -3.540742 -1.290126
C  -3.040236 2.045381 -1.311045
C  -3.715517 1.020544 0.733258
C  3.58844 -4.96393 -0.507648
C  -3.682928 3.217107 -0.949562
C  -4.365126 2.185399 1.114148
C  -4.343392 3.280261 0.267622
H  3.582043 1.369568 0.645419
H  3.206476 1.842544 -1.018897
H  -0.80362 0.946035 1.068136
H  -0.656183 -0.77927 1.299195
H  1.137422 -0.339988 2.957711
H  1.06556 1.396752 2.647806
H  2.59279 0.528951 2.492638
H  4.604271 -1.844222 -0.719584
H  4.634021 -0.850152 0.742305
H  5.171186 -0.188657 -0.798146
H  2.825941 -1.446133 -2.493191
H  1.72197 -0.070951 -2.350978
H  3.432213 0.180379 -2.692651
H  -0.450676 0.647598 -1.398886
H  -0.32653 -1.085969 -1.168547
H  -2.63914 -1.159454 -0.263688
H  -2.557772 -0.578313 -1.909554
H  3.735037 -4.022713 1.511903
H  1.5066 -3.021623 -1.9058
H  -2.527888 2.002265 -2.265191
H  -3.736762 0.166109 1.399157
H  4.228804 -5.831111 -0.498582
H  -3.673684 4.074355 -1.608492
H  -4.884271 2.239063 2.061114
totalener: -1513.49347034 hartree
nucrepener: 2386.22913321 hartree
electener: -3899.72260355 hartree
oneelecener: -6809.17094574 hartree
twoeener: 2909.44834219 hartree
kineticenergy: 1508.20011697 hartree
xcener: -124.310248677887 hartree
chargesum: -0.0000000
charge: -0.085203 -0.329547 -0.362617 -0.069272 -0.020702 -0.295196 0.254169 0.078211 0.082949 -0.176922 -0.306550 -0.325284 -0.357644 -0.113372 0.304344 -0.156146 0.047207 -0.125630 0.009259 -0.176820 -0.171446 -0.076848 -0.131200 -0.115628 0.079562 0.067383 0.089090 0.101429 0.098367 0.118108 0.105790 0.080591 0.114024 0.100537 0.107836 0.118459 0.122404 0.097864 0.077072 0.063443 0.090325 0.100976 0.146991 0.142255 0.111959 0.114751 0.129688 0.119265 0.121719
qa: -0.0852 -0.3295 -0.3626 -0.0693 -0.0207 -0.2952 0.2542 0.0782 0.0829 -0.1769 -0.3065 -0.3253 -0.3576 -0.1134 0.3043 -0.1561 0.0472 -0.1256 0.0093 -0.1768 -0.1714 -0.0768 -0.1312 -0.1156 0.0796 0.0674 0.0891 0.1014 0.0984 0.1181 0.1058 0.0806 0.1140 0.1005 0.1078 0.1185 0.1224 0.0979 0.0771 0.0634 0.0903 0.1010 0.1470 0.1423 0.1120 0.1148 0.1297 0.1193 0.1217
va: 1.2211 2.0335 2.1455 3.0651 3.2451 3.1343 4.1755 3.9575 3.9144 3.7161 3.9339 3.9493 3.9264 3.8746 4.2775 3.8910 3.6098 3.9136 4.0647 4.0162 3.9643 4.0218 4.0231 4.0063 3.9291 1.0027 0.9945 1.0226 1.0256 1.0219 1.0102 1.0079 0.9966 1.0036 1.0056 1.0035 0.9960 1.0109 1.0192 1.0212 1.0108 1.0047 1.0109 0.9956 1.0101 1.0104 1.0086 1.0120 1.0110
dispcorr: -0.028967939 hartree
energy: -1513.522438278828
dipole: 26.73620 -25.60739 1.12881 -11.73556 12.47677 0.74120 -5.19074 5.06713 -0.12361
magnitude: 1.35605 au
magnitude: 3.44681 debye
