program: Orca
programVersion: 4.2.1
elementType: Cl O O N N N C C C C C C C C C C C C C C C C C C C H H H H H H H H H H H H H H H H H H H H H H H H
charge: 0
multiplicity: 1
keywords: wb97x-d3
keywords: def2-TZVPP
keywords: def2/J RIJCOSX GRIDX6 NOFINALGRIDX
keywords: grid4 nofinalgrid
keywords: scfconv7
keywords: smallprint printgap noloewdin
keywords: NOSOSCF
formula: C19H24ClN3O2
InChI: InChI=1/C19H24ClN3O2/c1-18(2)13-25-19(3,23(18)17(24)22-12-11-21-14-22)10-4-5-15-6-8-16(20)9-7-15/h6-9,11-12,14H,4-5,10,13H2,1-3H3
49 atoms
Cl -5.223935 -0.806611 -0.877565
O  3.317184 1.417817 1.013294
O  1.456136 -1.311224 -1.890321
N  2.417612 -0.337369 -0.075298
N  0.449479 -1.61282 0.119699
N  -1.573027 -2.303749 0.661625
C  2.26316 0.498179 1.1534
C  3.676811 -0.001958 -0.774353
C  4.366798 0.768278 0.350904
C  0.955793 1.286714 1.204232
C  2.458282 -0.286094 2.451277
C  4.461389 -1.250862 -1.151838
C  3.48525 0.912277 -1.985289
C  0.711456 2.236732 0.04017
C  1.471297 -1.068058 -0.709211
C  -0.638626 2.956767 0.143132
C  -1.810251 2.046317 -0.096277
C  0.604191 -2.505685 1.157577
C  -0.887942 -1.561714 -0.151432
C  -2.213562 1.747934 -1.395293
C  -2.495595 1.443083 0.953119
C  -0.655151 -2.909517 1.473019
C  -3.263987 0.879079 -1.644237
C  -3.539795 0.560858 0.724314
C  -3.921944 0.285795 -0.577438
H  4.91619 0.090471 1.019651
H  5.066836 1.517202 -0.020891
H  0.975068 1.864314 2.134236
H  0.125416 0.587571 1.312467
H  2.671132 0.418015 3.255779
H  3.291302 -0.986781 2.385087
H  1.567529 -0.843685 2.728602
H  3.993359 -1.792787 -1.970673
H  4.558518 -1.925879 -0.300425
H  5.466191 -0.971755 -1.473308
H  4.461755 1.159557 -2.405813
H  2.898084 0.434784 -2.764406
H  3.000441 1.847734 -1.707304
H  1.506689 2.983532 0.01092
H  0.751546 1.702748 -0.913659
H  -0.657436 3.76827 -0.588108
H  -0.726235 3.430902 1.124758
H  1.570346 -2.796107 1.529774
H  -1.287834 -0.941842 -0.939255
H  -1.701426 2.205234 -2.233941
H  -2.207841 1.658684 1.975315
H  -0.949981 -3.614423 2.233911
H  -3.568386 0.66278 -2.659111
H  -4.044738 0.082306 1.55106
totalener: -1513.49204529 hartree
nucrepener: 2531.48673030 hartree
electener: -4044.97877559 hartree
oneelecener: -7100.33065309 hartree
twoeener: 3055.35187751 hartree
kineticenergy: 1508.19618053 hartree
xcener: -124.312046841707 hartree
chargesum: 0.0000000
charge: -0.079477 -0.330138 -0.355335 -0.073523 -0.004158 -0.295437 0.278518 0.105962 0.068254 -0.230924 -0.335049 -0.306077 -0.349572 -0.110201 0.274334 -0.149276 0.076853 -0.164928 0.029475 -0.221160 -0.145935 -0.075258 -0.143772 -0.145054 0.120536 0.065519 0.092809 0.097530 0.098366 0.111465 0.090092 0.116020 0.121879 0.084377 0.098237 0.094494 0.124881 0.106188 0.092582 0.070860 0.096933 0.087561 0.163213 0.157216 0.111661 0.117670 0.127779 0.122078 0.111933
qa: -0.0795 -0.3301 -0.3553 -0.0735 -0.0042 -0.2954 0.2785 0.1060 0.0683 -0.2309 -0.3350 -0.3061 -0.3496 -0.1102 0.2743 -0.1493 0.0769 -0.1649 0.0295 -0.2212 -0.1459 -0.0753 -0.1438 -0.1451 0.1205 0.0655 0.0928 0.0975 0.0984 0.1115 0.0901 0.1160 0.1219 0.0844 0.0982 0.0945 0.1249 0.1062 0.0926 0.0709 0.0969 0.0876 0.1632 0.1572 0.1117 0.1177 0.1278 0.1221 0.1119
va: 1.2223 2.0141 2.1359 3.0568 3.2422 3.0934 4.0971 3.9991 3.9318 3.7803 3.9229 3.9101 3.9103 3.8775 4.2958 3.8759 3.5372 3.9005 4.0015 3.9887 3.9059 4.0539 3.9957 4.0337 3.8572 1.0017 0.9948 1.0200 1.0062 1.0174 1.0090 1.0015 1.0127 1.0096 1.0031 1.0069 1.0216 0.9992 1.0226 1.0103 1.0072 1.0116 0.9923 1.0057 1.0124 1.0028 1.0085 1.0138 1.0198
dispcorr: -0.033143363 hartree
energy: -1513.525188652291
dipole: 36.71331 -34.62933 2.08398 11.14507 -10.14265 1.00242 5.30247 -4.51398 0.78849
magnitude: 2.44326 au
magnitude: 6.21027 debye
