program: Orca
programVersion: 4.2.1
elementType: Cl O O N N N C C C C C C C C C C C C C C C C C C C H H H H H H H H H H H H H H H H H H H H H H H H
charge: 0
multiplicity: 1
keywords: wb97x-d3
keywords: def2-TZVPP
keywords: def2/J RIJCOSX GRIDX6 NOFINALGRIDX
keywords: grid4 nofinalgrid
keywords: scfconv7
keywords: smallprint printgap noloewdin
keywords: NOSOSCF
formula: C19H24ClN3O2
InChI: InChI=1/C19H24ClN3O2/c1-18(2)13-25-19(3,23(18)17(24)22-12-11-21-14-22)10-4-5-15-6-8-16(20)9-7-15/h6-9,11-12,14H,4-5,10,13H2,1-3H3
49 atoms
Cl -5.6429 2.54331 -2.225254
O  2.832672 1.411279 0.914993
O  1.808734 -1.999373 -1.693039
N  2.571242 -0.588376 -0.086479
N  1.312731 -2.506116 0.459482
N  -0.302767 -3.643909 1.437307
C  2.466757 0.093982 1.23841
C  3.276313 0.282033 -1.056355
C  3.802673 1.34656 -0.092926
C  1.061862 0.149802 1.83382
C  3.458208 -0.467275 2.26096
C  4.421368 -0.433941 -1.75823
C  2.322098 0.928712 -2.061255
C  -0.027154 0.688047 0.918316
C  1.920049 -1.680572 -0.535409
C  -1.400546 0.629379 1.589385
C  -2.489361 1.104184 0.670745
C  1.902241 -3.236994 1.461582
C  -0.013107 -2.817663 0.479025
C  -3.270221 0.201744 -0.042676
C  -2.710376 2.463409 0.469086
C  0.884221 -3.92407 2.050659
C  -4.240768 0.632881 -0.934018
C  -3.67509 2.914139 -0.416496
C  -4.435905 1.9914 -1.11697
H  4.79022 1.074104 0.304456
H  3.888438 2.326374 -0.563202
H  1.137787 0.793095 2.71619
H  0.782692 -0.832097 2.218807
H  3.593326 0.262607 3.059177
H  4.433239 -0.672669 1.819046
H  3.094532 -1.383778 2.717261
H  5.07174 -0.935085 -1.039866
H  5.025858 0.293077 -2.303653
H  4.065845 -1.170591 -2.474491
H  2.878815 1.628636 -2.686685
H  1.858476 0.196446 -2.715818
H  1.536107 1.489229 -1.554691
H  0.196791 1.718224 0.633489
H  -0.073773 0.123888 -0.016793
H  -1.387856 1.235784 2.499777
H  -1.604774 -0.396933 1.907586
H  2.965307 -3.244391 1.62321
H  -0.707611 -2.393404 -0.229857
H  -3.12658 -0.862556 0.103709
H  -2.120364 3.188989 1.016894
H  0.946884 -4.617584 2.873794
H  -4.841791 -0.0821 -1.478659
H  -3.837286 3.973563 -0.559647
totalener: -1513.49403909 hartree
nucrepener: 2425.22143134 hartree
electener: -3938.71547043 hartree
oneelecener: -6887.12589021 hartree
twoeener: 2948.41041977 hartree
kineticenergy: 1508.19875953 hartree
xcener: -124.309629108100 hartree
chargesum: 0.0000000
charge: -0.085311 -0.324250 -0.358022 -0.060405 -0.001449 -0.294697 0.219493 0.098229 0.073447 -0.150229 -0.328391 -0.307934 -0.342216 -0.185709 0.275328 -0.117213 0.073634 -0.160681 0.036843 -0.187999 -0.193860 -0.086002 -0.132987 -0.128644 0.082253 0.065181 0.094538 0.104119 0.095047 0.114145 0.097412 0.107526 0.084791 0.099547 0.122502 0.092522 0.124339 0.109869 0.098955 0.079929 0.098728 0.096115 0.162838 0.129895 0.124195 0.115222 0.128973 0.121550 0.118833
qa: -0.0853 -0.3242 -0.3580 -0.0604 -0.0014 -0.2947 0.2195 0.0982 0.0734 -0.1502 -0.3284 -0.3079 -0.3422 -0.1857 0.2753 -0.1172 0.0736 -0.1607 0.0368 -0.1880 -0.1939 -0.0860 -0.1330 -0.1286 0.0823 0.0652 0.0945 0.1041 0.0950 0.1141 0.0974 0.1075 0.0848 0.0995 0.1225 0.0925 0.1243 0.1099 0.0990 0.0799 0.0987 0.0961 0.1628 0.1299 0.1242 0.1152 0.1290 0.1215 0.1188
va: 1.2213 2.0219 2.1390 3.0756 3.2423 3.0998 4.1121 3.9913 3.9175 3.7161 3.9257 3.9101 3.9179 3.8746 4.2896 3.7966 3.5897 3.9048 4.0262 4.0104 4.0221 4.0569 4.0357 4.0186 3.9284 1.0018 0.9950 1.0220 1.0088 1.0140 1.0068 1.0079 1.0071 1.0024 1.0153 1.0060 1.0205 0.9998 1.0320 1.0103 1.0074 1.0174 0.9923 1.0103 1.0062 1.0088 1.0106 1.0129 1.0126
dispcorr: -0.029870795 hartree
energy: -1513.523909887181
dipole: 34.91781 -32.87290 2.04491 -1.76452 2.67844 0.91392 10.28094 -9.49932 0.78162
magnitude: 2.37231 au
magnitude: 6.02992 debye
