program: Orca
programVersion: 4.2.1
elementType: Cl O O N N N C C C C C C C C C C C C C C C C C C C H H H H H H H H H H H H H H H H H H H H H H H H
charge: 0
multiplicity: 1
keywords: wb97x-d3
keywords: def2-TZVPP
keywords: def2/J RIJCOSX GRIDX6 NOFINALGRIDX
keywords: grid4 nofinalgrid
keywords: scfconv7
keywords: smallprint printgap noloewdin
keywords: NOSOSCF
formula: C19H24ClN3O2
InChI: InChI=1/C19H24ClN3O2/c1-18(2)13-25-19(3,23(18)17(24)22-12-11-21-14-22)10-4-5-15-6-8-16(20)9-7-15/h6-9,11-12,14H,4-5,10,13H2,1-3H3
49 atoms
Cl -5.576175 2.656507 -2.336954
O  2.820414 1.374749 0.96666
O  1.733055 -2.002569 -1.653266
N  2.536101 -0.618793 -0.040774
N  1.283464 -2.533073 0.50694
N  1.095998 -4.054193 2.092479
C  2.423736 0.064427 1.283312
C  3.261312 0.242567 -1.003291
C  3.799318 1.293683 -0.03167
C  1.008356 0.146612 1.850501
C  3.384676 -0.512975 2.325571
C  4.397682 -0.494089 -1.697711
C  2.328389 0.90964 -2.014684
C  -0.052156 0.697435 0.90955
C  1.865422 -1.697183 -0.49459
C  -1.434514 0.696134 1.564229
C  -2.49761 1.18344 0.622326
C  -0.039206 -2.900917 0.541373
C  1.919557 -3.283974 1.449978
C  -3.262072 0.290176 -0.119857
C  -2.709757 2.544794 0.426831
C  -0.132034 -3.816858 1.543907
C  -4.209045 0.731213 -1.030942
C  -3.651106 3.006027 -0.478547
C  -4.396896 2.091988 -1.205804
H  4.77753 1.000535 0.374636
H  3.908532 2.273249 -0.498009
H  1.076974 0.791947 2.732016
H  0.702815 -0.829532 2.229971
H  4.362368 -0.742208 1.900883
H  2.996343 -1.418318 2.784738
H  3.523274 0.21969 3.120974
H  4.033349 -1.223664 -2.416898
H  5.033195 -1.007702 -0.97462
H  5.019761 0.221198 -2.238647
H  1.548644 1.48406 -1.514055
H  2.904065 1.600153 -2.63364
H  1.856772 0.187539 -2.674393
H  0.205464 1.71401 0.604982
H  -0.105736 0.112617 -0.012482
H  -1.414526 1.321133 2.461677
H  -1.672582 -0.31672 1.901632
H  -0.766761 -2.480357 -0.131191
H  2.98881 -3.249758 1.585081
H  -3.122841 -0.775815 0.017579
H  -2.131345 3.263707 0.995214
H  -1.015533 -4.324417 1.896066
H  -4.797499 0.022969 -1.597607
H  -3.806761 4.067129 -0.616261
totalener: -1513.49404148 hartree
nucrepener: 2420.63501571 hartree
electener: -3934.12905719 hartree
oneelecener: -6877.79936150 hartree
twoeener: 2943.67030431 hartree
kineticenergy: 1508.19763518 hartree
xcener: -124.308724081577 hartree
chargesum: -0.0000000
charge: -0.083976 -0.324878 -0.355884 -0.058027 -0.003909 -0.292704 0.221757 0.092737 0.073860 -0.158273 -0.338682 -0.306359 -0.340279 -0.180709 0.273765 -0.110838 0.082560 -0.131813 0.001315 -0.188253 -0.193855 -0.078979 -0.130214 -0.126264 0.079009 0.065684 0.093991 0.103866 0.099046 0.097567 0.117373 0.115136 0.122015 0.085316 0.099477 0.109570 0.092409 0.124324 0.098341 0.083854 0.096661 0.086874 0.142123 0.149553 0.109747 0.116043 0.129738 0.120724 0.119459
qa: -0.0840 -0.3249 -0.3559 -0.0580 -0.0039 -0.2927 0.2218 0.0927 0.0739 -0.1583 -0.3387 -0.3064 -0.3403 -0.1807 0.2738 -0.1108 0.0826 -0.1318 0.0013 -0.1883 -0.1939 -0.0790 -0.1302 -0.1263 0.0790 0.0657 0.0940 0.1039 0.0990 0.0976 0.1174 0.1151 0.1220 0.0853 0.0995 0.1096 0.0924 0.1243 0.0983 0.0839 0.0967 0.0869 0.1421 0.1496 0.1097 0.1160 0.1297 0.1207 0.1195
va: 1.2226 2.0207 2.1399 3.0716 3.2451 3.1249 4.1071 3.9999 3.9194 3.7222 3.9362 3.9108 3.9153 3.8710 4.2893 3.7980 3.5779 3.9025 4.0579 4.0186 4.0222 4.0258 4.0352 4.0148 3.9329 1.0016 0.9951 1.0223 1.0050 1.0059 0.9988 1.0140 1.0147 1.0076 1.0025 0.9997 1.0061 1.0211 1.0326 1.0090 1.0095 1.0183 1.0106 0.9939 1.0115 1.0090 1.0091 1.0125 1.0123
dispcorr: -0.029746850 hartree
energy: -1513.523788326653
dipole: 32.39792 -31.16540 1.23252 -1.78885 2.94029 1.15145 9.82920 -9.40403 0.42517
magnitude: 1.73946 au
magnitude: 4.42135 debye
