program: Orca
programVersion: 4.2.1
elementType: Cl O O N N N C C C C C C C C C C C C C C C C C C C H H H H H H H H H H H H H H H H H H H H H H H H
charge: 0
multiplicity: 1
keywords: wb97x-d3
keywords: def2-TZVPP
keywords: def2/J RIJCOSX GRIDX6 NOFINALGRIDX
keywords: grid4 nofinalgrid
keywords: scfconv7
keywords: smallprint printgap noloewdin
keywords: NOSOSCF
formula: C19H24ClN3O2
InChI: InChI=1/C19H24ClN3O2/c1-18(2)13-25-19(3,23(18)17(24)22-12-11-21-14-22)10-4-5-15-6-8-16(20)9-7-15/h6-9,11-12,14H,4-5,10,13H2,1-3H3
49 atoms
Cl -5.417889 3.210612 1.872223
O  1.907611 1.257727 0.890325
O  3.25316 -1.882058 -1.895007
N  2.598504 -0.636947 -0.110647
N  1.529494 -2.663346 -0.642858
N  0.498022 -4.350565 0.333111
C  1.538768 -0.094228 0.794383
C  3.691108 0.349447 -0.270176
C  3.305452 1.320756 0.84607
C  0.121191 -0.138674 0.230012
C  1.574348 -0.725719 2.188193
C  5.062032 -0.262037 -0.018417
C  3.643336 1.071154 -1.618272
C  -0.059159 0.466242 -1.154155
C  2.534468 -1.694645 -0.94469
C  -1.496444 0.317909 -1.663017
C  -2.501691 1.02814 -0.800184
C  0.585495 -3.112378 -1.533572
C  1.441685 -3.468218 0.45406
C  -3.319115 0.333582 0.084421
C  -2.611283 2.415484 -0.839744
C  -0.053539 -4.131727 -0.897262
C  -4.217376 0.994124 0.90924
C  -3.502481 3.093241 -0.025191
C  -4.302395 2.374549 0.849685
H  3.759389 1.030424 1.803308
H  3.605594 2.345849 0.628301
H  -0.502336 0.405558 0.944928
H  -0.248886 -1.165251 0.243139
H  2.59136 -0.849208 2.561043
H  1.087003 -1.696821 2.208148
H  1.034702 -0.079535 2.880203
H  5.809506 0.530289 0.049923
H  5.363336 -0.931276 -0.820736
H  5.078685 -0.817456 0.920229
H  4.413884 1.843559 -1.640279
H  3.82636 0.395496 -2.44883
H  2.680455 1.558852 -1.771164
H  0.216467 1.522992 -1.134706
H  0.60579 -0.009671 -1.879855
H  -1.747307 -0.7446 -1.724109
H  -1.550534 0.705998 -2.683245
H  0.459195 -2.67026 -2.506762
H  2.124524 -3.383157 1.2843
H  -3.256942 -0.746996 0.134412
H  -1.989924 2.982768 -1.522991
H  -0.875269 -4.726684 -1.262289
H  -4.846208 0.438372 1.591027
H  -3.577876 4.170915 -0.070672
totalener: -1513.49362285 hartree
nucrepener: 2430.40960857 hartree
electener: -3943.90323142 hartree
oneelecener: -6897.41807692 hartree
twoeener: 2953.51484550 hartree
kineticenergy: 1508.19822149 hartree
xcener: -124.310422913338 hartree
chargesum: -0.0000000
charge: -0.084183 -0.323534 -0.358336 -0.054178 -0.003212 -0.291332 0.204751 0.099471 0.071469 -0.142997 -0.336645 -0.307686 -0.342259 -0.159454 0.271739 -0.140611 0.045294 -0.132978 0.001636 -0.174882 -0.173714 -0.085117 -0.116040 -0.130916 0.079333 0.066297 0.092907 0.111307 0.094325 0.096030 0.115982 0.116004 0.099165 0.121780 0.085834 0.093250 0.124116 0.104398 0.094027 0.081922 0.085945 0.102494 0.147396 0.149641 0.115927 0.113181 0.130457 0.122313 0.119682
qa: -0.0842 -0.3235 -0.3583 -0.0542 -0.0032 -0.2913 0.2048 0.0995 0.0715 -0.1430 -0.3366 -0.3077 -0.3423 -0.1595 0.2717 -0.1406 0.0453 -0.1330 0.0016 -0.1749 -0.1737 -0.0851 -0.1160 -0.1309 0.0793 0.0663 0.0929 0.1113 0.0943 0.0960 0.1160 0.1160 0.0992 0.1218 0.0858 0.0932 0.1241 0.1044 0.0940 0.0819 0.0859 0.1025 0.1474 0.1496 0.1159 0.1132 0.1305 0.1223 0.1197
va: 1.2224 2.0229 2.1381 3.0671 3.2436 3.1230 4.1638 3.9988 3.9249 3.6881 3.9380 3.9115 3.9143 3.8796 4.2958 3.8555 3.6032 3.9044 4.0583 3.9624 4.0184 4.0240 4.0126 4.0230 3.9294 1.0018 0.9951 1.0248 1.0019 1.0063 1.0005 1.0140 1.0024 1.0144 1.0082 1.0062 1.0212 1.0004 1.0217 1.0131 1.0188 1.0054 1.0062 0.9944 1.0115 1.0098 1.0086 1.0110 1.0122
dispcorr: -0.030113611 hartree
energy: -1513.523736461517
dipole: 30.13684 -29.25161 0.88523 -4.16515 5.22601 1.06086 -6.44047 6.44428 0.00381
magnitude: 1.38169 au
magnitude: 3.51197 debye
