program: Orca
programVersion: 4.2.1
elementType: Cl O O N N N C C C C C C C C C C C C C C C C C C C H H H H H H H H H H H H H H H H H H H H H H H H
charge: 0
multiplicity: 1
keywords: wb97x-d3
keywords: def2-TZVPP
keywords: def2/J RIJCOSX GRIDX6 NOFINALGRIDX
keywords: grid4 nofinalgrid
keywords: scfconv7
keywords: smallprint printgap noloewdin
keywords: NOSOSCF
formula: C19H24ClN3O2
InChI: InChI=1/C19H24ClN3O2/c1-18(2)13-25-19(3,23(18)17(24)22-12-11-21-14-22)10-4-5-15-6-8-16(20)9-7-15/h6-9,11-12,14H,4-5,10,13H2,1-3H3
49 atoms
Cl -4.727577 -0.576484 2.045452
O  2.579411 1.559523 0.717863
O  2.713545 -2.707099 -0.329762
N  2.404111 -0.4536 -0.289983
N  0.625226 -1.922348 -0.747516
N  -1.19897 -2.045387 -1.982616
C  1.590946 0.710549 0.189811
C  3.846757 -0.149372 -0.169976
C  3.749444 1.367545 -0.026857
C  0.859807 1.418588 -0.958148
C  0.650455 0.343928 1.327565
C  4.479555 -0.745379 1.089081
C  4.621634 -0.540113 -1.419461
C  0.350276 2.823532 -0.605353
C  2.003984 -1.737277 -0.42381
C  -1.090973 3.065332 -1.074272
C  -2.065782 2.189696 -0.337567
C  -0.226414 -2.786769 -0.103585
C  -0.011207 -1.531459 -1.889148
C  -2.441964 2.501998 0.966943
C  -2.552348 1.011038 -0.891676
C  -1.350585 -2.822217 -0.86731
C  -3.262319 1.664132 1.70261
C  -3.368716 0.154069 -0.168361
C  -3.716346 0.485733 1.128823
H  4.590575 1.792409 0.521342
H  3.699402 1.858083 -1.009999
H  0.019303 0.794606 -1.255421
H  1.516031 1.471992 -1.83128
H  0.281023 1.249258 1.806718
H  1.171348 -0.242513 2.084698
H  -0.219824 -0.209578 0.982064
H  3.948787 -0.427513 1.986764
H  5.511155 -0.399092 1.174387
H  4.493838 -1.83088 1.06069
H  5.62869 -0.122068 -1.372041
H  4.717813 -1.618927 -1.518352
H  4.140051 -0.151175 -2.317763
H  0.399581 3.002905 0.470292
H  1.00329 3.575982 -1.051535
H  -1.166203 2.888104 -2.150355
H  -1.344411 4.116804 -0.917941
H  0.038439 -3.269164 0.820954
H  0.46707 -0.903504 -2.624209
H  -2.085482 3.419055 1.42221
H  -2.29033 0.734957 -1.905605
H  -2.260815 -3.367089 -0.675328
H  -3.546658 1.922139 2.713491
H  -3.720852 -0.763412 -0.617851
totalener: -1513.49026322 hartree
nucrepener: 2516.95876153 hartree
electener: -4030.44902475 hartree
oneelecener: -7070.95138681 hartree
twoeener: 3040.50236207 hartree
kineticenergy: 1508.19578721 hartree
xcener: -124.310203553589 hartree
chargesum: 0.0000000
charge: -0.085621 -0.328423 -0.358838 -0.089698 -0.015945 -0.312570 0.348956 0.115442 0.045652 -0.211303 -0.338719 -0.337867 -0.306501 -0.179927 0.313692 -0.117520 0.132985 -0.113274 0.012761 -0.254792 -0.193223 -0.083601 -0.101929 -0.135068 0.088622 0.096390 0.067717 0.029370 0.101767 0.106332 0.109675 0.097336 0.102179 0.089357 0.121489 0.097516 0.121814 0.085299 0.084133 0.082322 0.088333 0.092773 0.148878 0.152278 0.115836 0.132235 0.130980 0.120620 0.132082
qa: -0.0856 -0.3284 -0.3588 -0.0897 -0.0159 -0.3126 0.3490 0.1154 0.0457 -0.2113 -0.3387 -0.3379 -0.3065 -0.1799 0.3137 -0.1175 0.1330 -0.1133 0.0128 -0.2548 -0.1932 -0.0836 -0.1019 -0.1351 0.0886 0.0964 0.0677 0.0294 0.1018 0.1063 0.1097 0.0973 0.1022 0.0894 0.1215 0.0975 0.1218 0.0853 0.0841 0.0823 0.0883 0.0928 0.1489 0.1523 0.1158 0.1322 0.1310 0.1206 0.1321
va: 1.2220 2.0119 2.1414 3.0654 3.2653 3.0836 3.9568 4.0160 3.9746 3.8837 3.9982 3.9154 3.9060 3.9262 4.2735 3.8350 3.5356 3.8964 4.0173 4.0024 3.9493 3.9868 3.9827 3.9684 3.9120 0.9941 0.9973 1.0561 1.0111 1.0116 1.0103 0.9916 1.0085 1.0051 1.0211 1.0033 1.0134 1.0099 1.0255 1.0178 1.0098 1.0092 1.0105 0.9936 1.0092 1.0120 1.0074 1.0114 1.0098
dispcorr: -0.033050753 hartree
energy: -1513.523313975900
dipole: 30.30726 -29.02314 1.28412 13.29673 -11.77264 1.52409 -6.80544 6.89226 0.08682
magnitude: 1.99483 au
magnitude: 5.07046 debye
