program: Orca
programVersion: 4.2.1
elementType: Cl O O N N N C C C C C C C C C C C C C C C C C C C H H H H H H H H H H H H H H H H H H H H H H H H
charge: 0
multiplicity: 1
keywords: wb97x-d3
keywords: def2-TZVPP
keywords: def2/J RIJCOSX GRIDX6 NOFINALGRIDX
keywords: grid4 nofinalgrid
keywords: scfconv7
keywords: smallprint printgap noloewdin
keywords: NOSOSCF
formula: C19H24ClN3O2
InChI: InChI=1/C19H24ClN3O2/c1-18(2)13-25-19(3,23(18)17(24)22-12-11-21-14-22)10-4-5-15-6-8-16(20)9-7-15/h6-9,11-12,14H,4-5,10,13H2,1-3H3
49 atoms
Cl -4.552299 -1.246768 0.368285
O  3.355195 1.62317 0.422964
O  0.294238 -0.804163 1.737832
N  1.877524 -0.056525 0.27816
N  0.328812 -1.711311 -0.33518
N  -0.710478 -2.352622 -2.174316
C  2.242384 1.119756 1.113348
C  3.025484 -0.456949 -0.576503
C  4.082654 0.515867 -0.021645
C  1.139893 2.171827 1.111098
C  2.634211 0.755524 2.548776
C  3.45515 -1.901587 -0.353452
C  2.838614 -0.181668 -2.068043
C  0.7586 2.719834 -0.259901
C  0.831824 -0.833147 0.659137
C  -0.662855 3.299426 -0.283828
C  -1.702544 2.224232 -0.126985
C  -0.171403 -2.969447 -0.085998
C  -0.056833 -1.389804 -1.606212
C  -2.01933 1.394216 -1.198997
C  -2.316052 1.969025 1.094731
C  -0.777638 -3.351684 -1.239672
C  -2.893313 0.328801 -1.06063
C  -3.195078 0.90906 1.254833
C  -3.472591 0.088407 0.175071
H  4.656579 0.0478 0.789343
H  4.788484 0.839769 -0.786569
H  1.462422 2.993157 1.757788
H  0.271695 1.731076 1.603368
H  1.765212 0.525017 3.157014
H  3.15288 1.605902 2.992746
H  3.301279 -0.106001 2.593361
H  3.559182 -2.12821 0.708612
H  4.424738 -2.071215 -0.824993
H  2.758173 -2.615089 -0.790526
H  2.469354 0.828664 -2.245174
H  3.801723 -0.273801 -2.572609
H  2.168524 -0.891759 -2.545718
H  1.471959 3.485698 -0.568302
H  0.814491 1.929064 -1.012439
H  -0.81598 3.826196 -1.228955
H  -0.772485 4.049184 0.504459
H  -0.045345 -3.457082 0.864536
H  0.127146 -0.415612 -2.026135
H  -1.570391 1.578613 -2.168949
H  -2.100482 2.603305 1.94635
H  -1.265876 -4.289549 -1.450214
H  -3.106525 -0.318934 -1.899584
H  -3.652229 0.71762 2.215672
totalener: -1513.49047203 hartree
nucrepener: 2574.06969497 hartree
electener: -4087.56016700 hartree
oneelecener: -7185.65736564 hartree
twoeener: 3098.09719864 hartree
kineticenergy: 1508.19799821 hartree
xcener: -124.312434698406 hartree
chargesum: 0.0000000
charge: -0.087003 -0.335101 -0.360733 -0.037047 0.024534 -0.296639 0.224484 0.075703 0.095398 -0.180102 -0.309322 -0.328592 -0.365151 -0.111543 0.289448 -0.136756 0.128375 -0.143872 -0.032073 -0.274866 -0.201007 -0.049443 -0.105950 -0.090137 0.089722 0.066684 0.087663 0.096183 0.098953 0.117155 0.105138 0.080293 0.102393 0.105135 0.113727 0.123215 0.098480 0.118815 0.091134 0.029048 0.094341 0.080851 0.147380 0.144290 0.129132 0.117602 0.128373 0.126825 0.114862
qa: -0.0870 -0.3351 -0.3607 -0.0370 0.0245 -0.2966 0.2245 0.0757 0.0954 -0.1801 -0.3093 -0.3286 -0.3652 -0.1115 0.2894 -0.1368 0.1284 -0.1439 -0.0321 -0.2749 -0.2010 -0.0494 -0.1059 -0.0901 0.0897 0.0667 0.0877 0.0962 0.0990 0.1172 0.1051 0.0803 0.1024 0.1051 0.1137 0.1232 0.0985 0.1188 0.0911 0.0290 0.0943 0.0809 0.1474 0.1443 0.1291 0.1176 0.1284 0.1268 0.1149
va: 1.2175 2.0290 2.1301 3.0326 3.2229 3.1108 4.1801 3.9586 3.8920 3.7511 3.9394 3.9504 3.9125 3.8958 4.2267 3.9060 3.5301 3.9224 4.1007 3.9466 4.0045 3.9942 3.9224 4.0219 3.9163 1.0024 0.9949 1.0181 1.0276 1.0197 1.0105 1.0081 1.0016 1.0049 1.0020 0.9965 1.0114 1.0026 1.0210 1.0262 1.0081 1.0104 1.0155 0.9928 1.0018 1.0053 1.0074 1.0213 1.0135
dispcorr: -0.034008428 hartree
energy: -1513.524480455416
dipole: 32.66789 -30.72675 1.94114 11.31601 -10.71863 0.59739 -1.65092 1.79966 0.14874
magnitude: 2.03642 au
magnitude: 5.17618 debye
