program: Orca
programVersion: 4.2.1
elementType: Cl O O N N N C C C C C C C C C C C C C C C C C C C H H H H H H H H H H H H H H H H H H H H H H H H
charge: 0
multiplicity: 1
keywords: wb97x-d3
keywords: def2-TZVPP
keywords: def2/J RIJCOSX GRIDX6 NOFINALGRIDX
keywords: grid4 nofinalgrid
keywords: scfconv7
keywords: smallprint printgap noloewdin
keywords: NOSOSCF
formula: C19H24ClN3O2
InChI: InChI=1/C19H24ClN3O2/c1-18(2)13-25-19(3,23(18)17(24)22-12-11-21-14-22)10-4-5-15-6-8-16(20)9-7-15/h6-9,11-12,14H,4-5,10,13H2,1-3H3
49 atoms
Cl -6.309144 1.805056 -1.818798
O  2.881807 1.66232 -0.107718
O  2.099265 -1.512029 2.400494
N  2.42507 -0.480805 0.401762
N  1.817036 -2.744986 0.514958
N  0.644466 -4.240157 -0.604965
C  2.570845 0.870449 1.009544
C  2.974966 -0.492847 -0.977215
C  3.664244 0.879613 -0.960718
C  1.267006 1.38795 1.610449
C  3.709049 0.942556 2.029016
C  4.001908 -1.591043 -1.223424
C  1.902018 -0.50222 -2.064253
C  0.067784 1.357891 0.674285
C  2.132965 -1.532902 1.195066
C  -1.170138 1.948196 1.334291
C  -2.435829 1.894481 0.515959
C  2.389376 -3.966318 0.775667
C  0.752446 -2.983087 -0.305462
C  -3.649353 2.229113 1.114974
C  -2.45742 1.531653 -0.825469
C  1.66863 -4.863508 0.050468
C  -4.839428 2.207004 0.410494
C  -3.641538 1.501836 -1.549366
C  -4.828576 1.840741 -0.926954
H  4.699913 0.791494 -0.604416
H  3.687436 1.343916 -1.946897
H  1.454751 2.417008 1.932524
H  1.049211 0.822268 2.517819
H  4.63489 0.521432 1.635112
H  3.467343 0.413244 2.945162
H  3.89463 1.988942 2.2721
H  3.550962 -2.570622 -1.368038
H  4.719384 -1.657276 -0.404341
H  4.560301 -1.359457 -2.132384
H  1.409183 -1.466867 -2.152116
H  1.146458 0.262559 -1.886256
H  2.363392 -0.296243 -3.031244
H  0.302327 1.912949 -0.23664
H  -0.144341 0.327821 0.373804
H  -0.969704 2.991656 1.600584
H  -1.350013 1.433738 2.283595
H  3.240464 -4.072881 1.425417
H  0.071442 -2.201259 -0.603278
H  -3.66642 2.512411 2.160985
H  -1.541332 1.262771 -1.3346
H  1.826994 -5.926772 -0.030683
H  -5.769478 2.468451 0.896045
H  -3.636136 1.214354 -2.59173
totalener: -1513.49228074 hartree
nucrepener: 2382.16437753 hartree
electener: -3895.65665827 hartree
oneelecener: -6800.92861743 hartree
twoeener: 2905.27195916 hartree
kineticenergy: 1508.19497070 hartree
xcener: -124.310523708500 hartree
chargesum: -0.0000000
charge: -0.085487 -0.335488 -0.359960 -0.075373 -0.020368 -0.295122 0.282652 0.073909 0.086419 -0.217359 -0.305687 -0.328549 -0.354806 -0.057516 0.303930 -0.134630 0.065184 -0.128728 0.011419 -0.178061 -0.157545 -0.074855 -0.148684 -0.167232 0.109512 0.066773 0.090238 0.091579 0.100636 0.081481 0.118922 0.104438 0.115717 0.100497 0.108136 0.121541 0.113490 0.100402 0.073900 0.054816 0.086939 0.083881 0.146879 0.144280 0.112423 0.109411 0.129649 0.120076 0.116323
qa: -0.0855 -0.3355 -0.3600 -0.0754 -0.0204 -0.2951 0.2827 0.0739 0.0864 -0.2174 -0.3057 -0.3285 -0.3548 -0.0575 0.3039 -0.1346 0.0652 -0.1287 0.0114 -0.1781 -0.1575 -0.0749 -0.1487 -0.1672 0.1095 0.0668 0.0902 0.0916 0.1006 0.0815 0.1189 0.1044 0.1157 0.1005 0.1081 0.1215 0.1135 0.1004 0.0739 0.0548 0.0869 0.0839 0.1469 0.1443 0.1124 0.1094 0.1296 0.1201 0.1163
va: 1.2211 2.0307 2.1480 3.0625 3.2446 3.1325 4.0892 3.9612 3.9076 3.8030 3.9369 3.9507 3.9249 3.8787 4.2727 3.9013 3.6976 3.9146 4.0584 4.0370 3.9628 4.0213 4.0314 4.0932 3.9043 1.0034 0.9949 1.0188 1.0258 1.0080 1.0216 1.0101 0.9961 1.0030 1.0054 1.0029 0.9973 1.0107 1.0140 1.0116 0.9969 0.9993 1.0107 0.9948 1.0098 1.0088 1.0086 1.0126 1.0159
dispcorr: -0.028495681 hartree
energy: -1513.520776419894
dipole: 35.61990 -33.73495 1.88495 0.65850 0.24555 0.90405 4.03408 -4.18777 -0.15368
magnitude: 2.09618 au
magnitude: 5.32807 debye
