program: Orca
programVersion: 4.2.1
elementType: Cl O O N N N C C C C C C C C C C C C C C C C C C C H H H H H H H H H H H H H H H H H H H H H H H H
charge: 0
multiplicity: 1
keywords: wb97x-d3
keywords: def2-TZVPP
keywords: def2/J RIJCOSX GRIDX6 NOFINALGRIDX
keywords: grid4 nofinalgrid
keywords: scfconv7
keywords: smallprint printgap noloewdin
keywords: NOSOSCF
formula: C19H24ClN3O2
InChI: InChI=1/C19H24ClN3O2/c1-18(2)13-25-19(3,23(18)17(24)22-12-11-21-14-22)10-4-5-15-6-8-16(20)9-7-15/h6-9,11-12,14H,4-5,10,13H2,1-3H3
49 atoms
Cl -6.071358 1.808325 -1.967744
O  3.059432 1.531779 -0.208342
O  1.277035 -1.225592 2.28275
N  2.320295 -0.52363 0.394257
N  1.664853 -2.768859 0.667201
N  0.71777 -4.677093 0.100539
C  2.585457 0.841675 0.92399
C  2.64873 -0.599099 -1.047282
C  2.600717 0.896463 -1.366525
C  1.350979 1.550214 1.501701
C  3.704615 0.817836 1.955635
C  4.060798 -1.12649 -1.299577
C  1.626173 -1.336103 -1.90198
C  0.08033 1.518163 0.663462
C  1.739509 -1.44278 1.189701
C  -1.11273 2.09353 1.430011
C  -2.372792 2.043957 0.615113
C  2.686161 -3.658287 0.437299
C  0.503273 -3.452954 0.473792
C  -2.748821 3.109466 -0.195657
C  -3.169817 0.903251 0.60757
C  2.074438 -4.823303 0.0858
C  -3.88176 3.046865 -0.991596
C  -4.305782 0.820729 -0.181294
C  -4.654846 1.897635 -0.980177
H  3.259206 1.159209 -2.196167
H  1.581424 1.20103 -1.634996
H  1.65247 2.591268 1.653384
H  1.139344 1.145808 2.490016
H  3.960393 1.836037 2.249208
H  4.599371 0.349152 1.547047
H  3.402624 0.276623 2.849878
H  4.309024 -1.021017 -2.356699
H  4.152655 -2.181906 -1.057973
H  4.803993 -0.570864 -0.728178
H  0.605794 -1.055505 -1.638196
H  1.780859 -1.055025 -2.945481
H  1.71828 -2.418621 -1.849991
H  0.209815 2.088986 -0.259161
H  -0.165308 0.495521 0.363923
H  -0.896441 3.12456 1.723156
H  -1.246383 1.530334 2.357435
H  3.719746 -3.407932 0.596375
H  -0.461258 -2.987499 0.605927
H  -2.149188 4.012015 -0.205241
H  -2.902771 0.061386 1.235783
H  2.540184 -5.763376 -0.162895
H  -4.163532 3.88584 -1.612748
H  -4.917182 -0.071056 -0.17208
totalener: -1513.49223340 hartree
nucrepener: 2394.37428884 hartree
electener: -3907.86652224 hartree
oneelecener: -6825.29822310 hartree
twoeener: 2917.43170086 hartree
kineticenergy: 1508.20088921 hartree
xcener: -124.309627027264 hartree
chargesum: -0.0000000
charge: -0.084611 -0.331980 -0.360764 -0.092991 -0.011886 -0.291951 0.356775 0.119003 0.029948 -0.256155 -0.299761 -0.335198 -0.327671 -0.123781 0.273070 -0.105136 0.068371 -0.155187 0.046879 -0.192812 -0.207861 -0.090767 -0.124065 -0.120549 0.076100 0.094202 0.070625 0.092831 0.096976 0.103583 0.090120 0.106346 0.096176 0.102215 0.116667 0.103016 0.109888 0.117406 0.097514 0.067555 0.083724 0.095311 0.160072 0.131775 0.113978 0.120993 0.129404 0.120179 0.122423
qa: -0.0846 -0.3320 -0.3608 -0.0930 -0.0119 -0.2920 0.3568 0.1190 0.0299 -0.2562 -0.2998 -0.3352 -0.3277 -0.1238 0.2731 -0.1051 0.0684 -0.1552 0.0469 -0.1928 -0.2079 -0.0908 -0.1241 -0.1205 0.0761 0.0942 0.0706 0.0928 0.0970 0.1036 0.0901 0.1063 0.0962 0.1022 0.1167 0.1030 0.1099 0.1174 0.0975 0.0676 0.0837 0.0953 0.1601 0.1318 0.1140 0.1210 0.1294 0.1202 0.1224
va: 1.2221 2.0356 2.1334 3.0796 3.2438 3.1343 3.9772 3.9145 3.9826 3.8851 3.9464 3.9372 3.9453 3.8675 4.3072 3.8320 3.6165 3.9123 4.0503 4.0131 4.0072 4.0629 4.0069 4.0015 3.9303 0.9947 0.9870 1.0185 1.0271 1.0067 1.0095 1.0117 1.0079 1.0124 1.0036 1.0037 1.0061 0.9959 1.0088 1.0138 1.0120 1.0107 0.9935 1.0100 1.0100 1.0095 1.0109 1.0122 1.0112
dispcorr: -0.028706319 hartree
energy: -1513.520939717909
dipole: 33.84934 -32.25019 1.59915 0.68379 0.34399 1.02778 3.26543 -3.79764 -0.53221
magnitude: 1.97404 au
magnitude: 5.01762 debye
