program: Orca
programVersion: 4.2.1
elementType: Cl O O N N N C C C C C C C C C C C C C C C C C C C H H H H H H H H H H H H H H H H H H H H H H H H
charge: 0
multiplicity: 1
keywords: wb97x-d3
keywords: def2-TZVPP
keywords: def2/J RIJCOSX GRIDX6 NOFINALGRIDX
keywords: grid4 nofinalgrid
keywords: scfconv7
keywords: smallprint printgap noloewdin
keywords: NOSOSCF
formula: C19H24ClN3O2
InChI: InChI=1/C19H24ClN3O2/c1-18(2)13-25-19(3,23(18)17(24)22-12-11-21-14-22)10-4-5-15-6-8-16(20)9-7-15/h6-9,11-12,14H,4-5,10,13H2,1-3H3
49 atoms
Cl -5.179268 -0.929701 1.318295
O  3.008071 1.591796 0.621338
O  2.620435 -1.98758 -1.897301
N  2.60707 -0.462123 -0.217004
N  0.657628 -1.653579 -0.828572
N  -1.428019 -2.040566 -1.432693
C  1.960099 0.660616 0.534215
C  4.069494 -0.237393 -0.298771
C  4.200963 0.869429 0.746007
C  0.819211 1.317443 -0.235441
C  1.53112 0.246123 1.948468
C  4.870189 -1.468419 0.099452
C  4.506456 0.29996 -1.663316
C  0.355034 2.642917 0.362205
C  2.041357 -1.383465 -1.027448
C  -0.985901 3.097001 -0.229324
C  -2.100142 2.149613 0.119348
C  -0.012381 -2.051313 0.305266
C  -0.249193 -1.693202 -1.846779
C  -2.56848 1.211701 -0.792646
C  -2.632807 2.132119 1.406374
C  -1.293183 -2.27833 -0.093698
C  -3.521004 0.268317 -0.439559
C  -3.588505 1.202243 1.778297
C  -4.020361 0.267397 0.849665
H  4.328355 0.455713 1.756598
H  5.040789 1.53489 0.54473
H  -0.026775 0.632288 -0.259233
H  1.133937 1.478116 -1.271243
H  1.554577 1.11521 2.60458
H  2.194432 -0.508259 2.371647
H  0.51666 -0.145049 1.964504
H  4.527649 -1.867109 1.055531
H  5.922685 -1.200456 0.207605
H  4.805689 -2.256532 -0.646571
H  4.361542 -0.42945 -2.454413
H  3.960026 1.207949 -1.920981
H  5.56826 0.550693 -1.629416
H  0.237131 2.555923 1.445478
H  1.108153 3.414583 0.195872
H  -0.898905 3.188745 -1.315249
H  -1.215614 4.097377 0.145501
H  0.479575 -2.187449 1.250819
H  0.023032 -1.443665 -2.860348
H  -2.169379 1.194042 -1.799324
H  -2.292034 2.855485 2.138223
H  -2.125678 -2.601226 0.5109
H  -3.837703 -0.476398 -1.155341
H  -3.990808 1.198947 2.78193
totalener: -1513.49168650 hartree
nucrepener: 2503.70039393 hartree
electener: -4017.19208043 hartree
oneelecener: -7044.57320869 hartree
twoeener: 3027.38112826 hartree
kineticenergy: 1508.20538773 hartree
xcener: -124.313417372314 hartree
chargesum: -0.0000000
charge: -0.090502 -0.318077 -0.373787 -0.076610 -0.024790 -0.317976 0.224533 0.114026 0.068306 -0.111407 -0.369300 -0.307087 -0.344550 -0.165087 0.335336 -0.121369 0.080920 -0.160421 0.039894 -0.146497 -0.216609 -0.050657 -0.134306 -0.119427 0.083933 0.065806 0.093902 0.035960 0.096498 0.115298 0.101355 0.116900 0.085110 0.098132 0.122123 0.121938 0.101911 0.089046 0.079554 0.090185 0.082207 0.098663 0.163990 0.135069 0.117512 0.112870 0.127723 0.130515 0.119244
qa: -0.0905 -0.3181 -0.3738 -0.0766 -0.0248 -0.3180 0.2245 0.1140 0.0683 -0.1114 -0.3693 -0.3071 -0.3445 -0.1651 0.3353 -0.1214 0.0809 -0.1604 0.0399 -0.1465 -0.2166 -0.0507 -0.1343 -0.1194 0.0839 0.0658 0.0939 0.0360 0.0965 0.1153 0.1014 0.1169 0.0851 0.0981 0.1221 0.1219 0.1019 0.0890 0.0796 0.0902 0.0822 0.0987 0.1640 0.1351 0.1175 0.1129 0.1277 0.1305 0.1192
va: 1.2152 2.0164 2.1276 3.0659 3.2653 3.0727 4.0627 4.0088 3.9331 3.8188 3.9260 3.9055 3.9160 3.9212 4.2615 3.8623 3.5708 3.8911 4.0357 3.9038 4.0159 3.9879 3.9410 4.0185 3.8882 1.0000 0.9943 1.0390 1.0136 1.0124 1.0065 1.0031 1.0085 1.0025 1.0144 1.0215 1.0081 1.0048 1.0060 1.0287 1.0125 1.0065 0.9938 1.0117 1.0117 1.0093 1.0135 1.0255 1.0127
dispcorr: -0.032202462 hartree
energy: -1513.523888963586
dipole: 34.31505 -32.66225 1.65280 12.69789 -11.47028 1.22762 0.83680 0.22412 1.06092
magnitude: 2.31610 au
magnitude: 5.88706 debye
