program: Orca
programVersion: 4.2.1
elementType: Cl O O N N N C C C C C C C C C C C C C C C C C C C H H H H H H H H H H H H H H H H H H H H H H H H
charge: 0
multiplicity: 1
keywords: wb97x-d3
keywords: def2-TZVPP
keywords: def2/J RIJCOSX GRIDX6 NOFINALGRIDX
keywords: grid4 nofinalgrid
keywords: scfconv7
keywords: smallprint printgap noloewdin
keywords: NOSOSCF
formula: C19H24ClN3O2
InChI: InChI=1/C19H24ClN3O2/c1-18(2)13-25-19(3,23(18)17(24)22-12-11-21-14-22)10-4-5-15-6-8-16(20)9-7-15/h6-9,11-12,14H,4-5,10,13H2,1-3H3
49 atoms
Cl -5.1593 -0.908598 -0.451474
O  3.146671 1.53291 0.71783
O  1.978624 -1.748524 -1.976532
N  2.52236 -0.43761 -0.197381
N  0.556184 -1.722024 -0.206397
N  -0.731316 -2.785677 1.235052
C  2.078656 0.618068 0.768211
C  3.882042 -0.1359 -0.691638
C  4.314584 0.820528 0.415938
C  0.825499 1.333731 0.274334
C  1.933731 0.103864 2.200769
C  4.765528 -1.373974 -0.731027
C  3.883516 0.591873 -2.037214
C  0.372178 2.503158 1.138952
C  1.736088 -1.300344 -0.884208
C  -0.865384 3.189898 0.547102
C  -1.991672 2.225177 0.293396
C  -0.708427 -1.738673 -0.747447
C  0.4771 -2.391438 0.98125
C  -2.639601 1.593611 1.351947
C  -2.370439 1.882894 -0.999632
C  -1.485593 -2.369832 0.172155
C  -3.616724 0.637636 1.133413
C  -3.352448 0.93321 -1.239732
C  -3.964416 0.309374 -0.167234
H  4.698459 0.270669 1.287256
H  5.083076 1.522529 0.091036
H  0.006168 0.61799 0.219503
H  1.011891 1.68191 -0.746994
H  2.721999 -0.605586 2.453205
H  0.97451 -0.378418 2.374532
H  2.010471 0.943614 2.890562
H  4.473553 -2.057799 -1.524836
H  4.732232 -1.910605 0.217973
H  5.800611 -1.079901 -0.9133
H  3.294913 1.508767 -1.993834
H  4.906372 0.868028 -2.299448
H  3.491809 -0.033673 -2.834201
H  0.132167 2.151074 2.145759
H  1.171666 3.238553 1.247398
H  -0.592203 3.684408 -0.388499
H  -1.192771 3.980513 1.227144
H  -0.931765 -1.287177 -1.698018
H  1.347645 -2.583363 1.588215
H  -2.371152 1.841536 2.372243
H  -1.884884 2.360211 -1.842459
H  -2.548381 -2.545791 0.126269
H  -4.09999 0.146366 1.966446
H  -3.633195 0.67768 -2.252402
totalener: -1513.49169534 hartree
nucrepener: 2510.39139031 hartree
electener: -4023.88308565 hartree
oneelecener: -7057.80048793 hartree
twoeener: 3033.91740228 hartree
kineticenergy: 1508.19807690 hartree
xcener: -124.310592180203 hartree
chargesum: -0.0000000
charge: -0.085848 -0.328851 -0.358131 -0.090365 -0.024226 -0.295546 0.279168 0.120021 0.061628 -0.144840 -0.371248 -0.302461 -0.343563 -0.157307 0.311929 -0.139901 0.051334 -0.112746 0.011439 -0.158854 -0.126021 -0.075120 -0.111762 -0.177309 0.080869 0.065561 0.091613 0.044200 0.096318 0.095773 0.127175 0.112525 0.121978 0.085390 0.097064 0.099450 0.090612 0.120893 0.076383 0.094873 0.082182 0.102335 0.145999 0.145489 0.111021 0.110111 0.126429 0.120271 0.124066
qa: -0.0858 -0.3289 -0.3581 -0.0904 -0.0242 -0.2955 0.2792 0.1200 0.0616 -0.1448 -0.3712 -0.3025 -0.3436 -0.1573 0.3119 -0.1399 0.0513 -0.1127 0.0114 -0.1589 -0.1260 -0.0751 -0.1118 -0.1773 0.0809 0.0656 0.0916 0.0442 0.0963 0.0958 0.1272 0.1125 0.1220 0.0854 0.0971 0.0995 0.0906 0.1209 0.0764 0.0949 0.0822 0.1023 0.1460 0.1455 0.1110 0.1101 0.1264 0.1203 0.1241
va: 1.2175 2.0120 2.1412 3.0471 3.2592 3.1249 4.0644 4.0137 3.9609 3.8035 3.9460 3.8968 3.9132 3.8734 4.2836 3.8579 3.6170 3.8906 4.0427 3.9776 3.9283 4.0015 3.9786 4.0163 3.8790 1.0002 0.9943 1.0580 1.0124 1.0112 0.9941 1.0116 1.0134 1.0112 1.0029 1.0083 1.0053 1.0213 1.0026 1.0330 1.0116 1.0061 1.0149 0.9969 1.0093 1.0101 1.0212 1.0123 1.0116
dispcorr: -0.032263481 hartree
energy: -1513.523958817092
dipole: 33.84120 -32.42590 1.41530 13.54513 -11.94942 1.59571 4.03987 -3.69493 0.34494
magnitude: 2.16064 au
magnitude: 5.49191 debye
