program: Orca
programVersion: 4.2.1
elementType: Cl O O N N N C C C C C C C C C C C C C C C C C C C H H H H H H H H H H H H H H H H H H H H H H H H
charge: 0
multiplicity: 1
keywords: wb97x-d3
keywords: def2-TZVPP
keywords: def2/J RIJCOSX GRIDX6 NOFINALGRIDX
keywords: grid4 nofinalgrid
keywords: scfconv7
keywords: smallprint printgap noloewdin
keywords: NOSOSCF
formula: C19H24ClN3O2
InChI: InChI=1/C19H24ClN3O2/c1-18(2)13-25-19(3,23(18)17(24)22-12-11-21-14-22)10-4-5-15-6-8-16(20)9-7-15/h6-9,11-12,14H,4-5,10,13H2,1-3H3
49 atoms
Cl -5.570203 3.119168 1.797028
O  2.101978 1.374865 0.772902
O  3.843205 -2.456104 -0.585225
N  2.566074 -0.601277 -0.239666
N  1.630823 -2.757483 -0.183969
N  -0.246001 -3.788073 -0.717835
C  1.593547 0.064104 0.684048
C  3.655422 0.332723 -0.594816
C  2.930573 1.645822 -0.323222
C  0.147819 0.11195 0.182326
C  1.637349 -0.534107 2.085256
C  4.87733 0.215161 0.319511
C  4.049737 0.22048 -2.060144
C  -0.06587 0.660264 -1.221734
C  2.785218 -1.934332 -0.341099
C  -1.494888 0.432605 -1.726159
C  -2.533478 1.092332 -0.86268
C  1.560861 -3.879763 0.607128
C  0.522451 -2.777839 -0.98046
C  -2.708419 2.473064 -0.89652
C  -3.322854 0.354537 0.012308
C  0.384749 -4.478619 0.279916
C  -3.636493 3.103414 -0.08511
C  -4.257392 0.967631 0.833417
C  -4.407685 2.342738 0.780106
H  3.618167 2.44826 -0.051471
H  2.360899 1.970603 -1.203287
H  -0.397751 0.736105 0.894873
H  -0.300678 -0.879037 0.269818
H  1.07537 0.102942 2.768072
H  2.661419 -0.601299 2.451869
H  1.187493 -1.524779 2.116409
H  5.601074 0.987322 0.053347
H  5.368176 -0.74879 0.221186
H  4.609124 0.36525 1.365693
H  4.698621 1.05636 -2.327776
H  4.593419 -0.697601 -2.270186
H  3.17178 0.261067 -2.706796
H  0.150218 1.731417 -1.239135
H  0.630742 0.196584 -1.927341
H  -1.696248 -0.640906 -1.781153
H  -1.57346 0.811044 -2.748572
H  2.332627 -4.131032 1.313683
H  0.358882 -2.042341 -1.752331
H  -2.112019 3.073209 -1.574029
H  -3.211197 -0.722406 0.055294
H  -0.041773 -5.372042 0.706579
H  -3.76347 4.17638 -0.126655
H  -4.864837 0.378549 1.506519
totalener: -1513.49159447 hartree
nucrepener: 2420.75081689 hartree
electener: -3934.24241136 hartree
oneelecener: -6878.08585864 hartree
twoeener: 2943.84344727 hartree
kineticenergy: 1508.19318318 hartree
xcener: -124.308750043648 hartree
chargesum: -0.0000000
charge: -0.083878 -0.328089 -0.353379 -0.129736 -0.019376 -0.300270 0.351311 0.156656 0.024732 -0.268454 -0.314151 -0.340723 -0.313646 -0.174020 0.307155 -0.152038 0.048300 -0.143725 0.000018 -0.168302 -0.156300 -0.065421 -0.133710 -0.127689 0.084673 0.096130 0.063761 0.111872 0.101735 0.110179 0.104955 0.102605 0.092018 0.120948 0.103456 0.099755 0.122393 0.089179 0.094652 0.078363 0.093751 0.102577 0.154636 0.152452 0.112023 0.120425 0.130419 0.119414 0.122364
qa: -0.0839 -0.3281 -0.3534 -0.1297 -0.0194 -0.3003 0.3513 0.1567 0.0247 -0.2685 -0.3142 -0.3407 -0.3136 -0.1740 0.3072 -0.1520 0.0483 -0.1437 0.0000 -0.1683 -0.1563 -0.0654 -0.1337 -0.1277 0.0847 0.0961 0.0638 0.1119 0.1017 0.1102 0.1050 0.1026 0.0920 0.1209 0.1035 0.0998 0.1224 0.0892 0.0947 0.0784 0.0938 0.1026 0.1546 0.1525 0.1120 0.1204 0.1304 0.1194 0.1224
va: 1.2226 2.0225 2.1441 3.0591 3.2650 3.1077 4.0392 3.9609 3.9956 3.8142 3.9607 3.9195 3.9128 3.8796 4.2804 3.8824 3.6003 3.9128 4.0339 4.0100 3.9604 4.0189 4.0300 4.0228 3.9255 0.9972 0.9871 1.0236 0.9945 1.0124 1.0038 0.9996 1.0047 1.0210 1.0052 1.0026 1.0135 1.0045 1.0042 1.0207 1.0142 1.0068 1.0078 0.9958 1.0098 1.0122 1.0072 1.0123 1.0114
dispcorr: -0.029896509 hartree
energy: -1513.521490979613
dipole: 30.63245 -29.69538 0.93707 -3.31045 4.26973 0.95928 -8.32166 8.23890 -0.08276
magnitude: 1.34357 au
magnitude: 3.41508 debye
