program: Orca
programVersion: 4.2.1
elementType: Cl O O N N N C C C C C C C C C C C C C C C C C C C H H H H H H H H H H H H H H H H H H H H H H H H
charge: 0
multiplicity: 1
keywords: wb97x-d3
keywords: def2-TZVPP
keywords: def2/J RIJCOSX GRIDX6 NOFINALGRIDX
keywords: grid4 nofinalgrid
keywords: scfconv7
keywords: smallprint printgap noloewdin
keywords: NOSOSCF
formula: C19H24ClN3O2
InChI: InChI=1/C19H24ClN3O2/c1-18(2)13-25-19(3,23(18)17(24)22-12-11-21-14-22)10-4-5-15-6-8-16(20)9-7-15/h6-9,11-12,14H,4-5,10,13H2,1-3H3
49 atoms
Cl -4.154789 1.795938 -2.907417
O  1.775854 1.420055 -0.22438
O  1.433032 -1.695871 2.459059
N  1.622425 -0.726424 0.409487
N  1.68646 -3.057967 0.661051
N  2.662067 -4.828785 -0.22168
C  1.71158 0.658351 0.952373
C  1.222619 -0.689507 -1.022114
C  0.914644 0.811751 -1.144376
C  0.457138 1.02451 1.765177
C  2.995793 0.890065 1.724962
C  2.362705 -1.045141 -1.973851
C  -0.02643 -1.502993 -1.334789
C  0.2966 2.523859 2.014535
C  1.55841 -1.770799 1.261304
C  -1.173503 2.922395 2.201801
C  -1.977403 2.6752 0.954977
C  0.846756 -4.121437 0.887676
C  2.776684 -3.558044 0.009631
C  -2.862977 1.607139 0.85789
C  -1.796132 3.475111 -0.170859
C  1.45534 -5.190779 0.308027
C  -3.537219 1.328721 -0.3224
C  -2.463073 3.217219 -1.356726
C  -3.328586 2.136191 -1.427431
H  1.131988 1.197631 -2.140514
H  -0.14093 1.021131 -0.924043
H  0.471943 0.489123 2.712631
H  -0.418099 0.648159 1.229382
H  3.004966 0.326911 2.654956
H  3.092786 1.947818 1.970176
H  3.860713 0.602121 1.128007
H  2.592459 -2.107668 -1.968907
H  3.267505 -0.48779 -1.730879
H  2.076835 -0.790361 -2.995461
H  -0.822578 -1.298708 -0.616924
H  -0.397972 -1.220306 -2.321369
H  0.158394 -2.575155 -1.356981
H  0.860394 2.822953 2.901513
H  0.70734 3.098306 1.18204
H  -1.225738 3.979852 2.472781
H  -1.605871 2.368746 3.039156
H  -0.085142 -4.01257 1.414474
H  3.633169 -2.946046 -0.22471
H  -3.028514 0.971429 1.719601
H  -1.1150 4.316699 -0.125302
H  1.092871 -6.204254 0.246911
H  -4.219768 0.491976 -0.379924
H  -2.311807 3.850049 -2.220403
totalener: -1513.49218789 hartree
nucrepener: 2467.76209348 hartree
electener: -3981.25428136 hartree
oneelecener: -6972.16900915 hartree
twoeener: 2990.91472779 hartree
kineticenergy: 1508.19812835 hartree
xcener: -124.310588432762 hartree
chargesum: 0.0000000
charge: -0.080799 -0.342066 -0.367446 -0.097029 -0.031758 -0.298062 0.352797 0.082254 0.122746 -0.251090 -0.289123 -0.353651 -0.331908 -0.161059 0.326046 -0.131189 0.079962 -0.134460 0.007589 -0.180647 -0.196748 -0.072465 -0.135057 -0.122071 0.084738 0.094853 0.018734 0.124279 0.047756 0.110518 0.101605 0.092968 0.119877 0.116435 0.094066 0.097862 0.109546 0.119107 0.087474 0.090566 0.098658 0.083603 0.145726 0.152449 0.124229 0.114430 0.129207 0.124018 0.122531
qa: -0.0808 -0.3421 -0.3674 -0.0970 -0.0318 -0.2981 0.3528 0.0823 0.1227 -0.2511 -0.2891 -0.3537 -0.3319 -0.1611 0.3260 -0.1312 0.0800 -0.1345 0.0076 -0.1806 -0.1967 -0.0725 -0.1351 -0.1221 0.0847 0.0949 0.0187 0.1243 0.0478 0.1105 0.1016 0.0930 0.1199 0.1164 0.0941 0.0979 0.1095 0.1191 0.0875 0.0906 0.0987 0.0836 0.1457 0.1524 0.1242 0.1144 0.1292 0.1240 0.1225
va: 1.2261 2.0252 2.1337 3.1258 3.2590 3.1269 4.0921 4.0002 3.9171 3.8617 3.9139 3.9261 3.9501 3.8378 4.2657 3.8906 3.6098 3.9209 4.0510 3.9303 3.9686 4.0234 3.9839 3.9818 3.9030 0.9966 1.0174 1.0390 1.0199 1.0140 1.0042 1.0176 1.0036 1.0054 1.0093 1.0004 1.0071 0.9969 1.0095 1.0297 1.0059 1.0100 1.0112 0.9921 1.0069 1.0111 1.0082 1.0108 1.0114
dispcorr: -0.030928763 hartree
energy: -1513.523116650088
dipole: 16.07957 -16.57539 -0.49581 3.04526 -1.67584 1.36942 9.22355 -9.34829 -0.12474
magnitude: 1.46175 au
magnitude: 3.71546 debye
