program: Orca
programVersion: 4.2.1
elementType: Cl O O N N N C C C C C C C C C C C C C C C C C C C H H H H H H H H H H H H H H H H H H H H H H H H
charge: 0
multiplicity: 1
keywords: wb97x-d3
keywords: def2-TZVPP
keywords: def2/J RIJCOSX GRIDX6 NOFINALGRIDX
keywords: grid4 nofinalgrid
keywords: scfconv7
keywords: smallprint printgap noloewdin
keywords: NOSOSCF
formula: C19H24ClN3O2
InChI: InChI=1/C19H24ClN3O2/c1-18(2)13-25-19(3,23(18)17(24)22-12-11-21-14-22)10-4-5-15-6-8-16(20)9-7-15/h6-9,11-12,14H,4-5,10,13H2,1-3H3
49 atoms
Cl -4.262637 1.388941 -2.834597
O  1.577222 1.364044 -0.567063
O  1.779942 -1.344859 2.536394
N  1.618159 -0.6784 0.36842
N  1.779212 -2.951836 0.934952
N  2.612795 -4.839836 0.156153
C  1.73572 0.772018 0.695101
C  1.048456 -0.852528 -0.993315
C  0.628539 0.600616 -1.257253
C  0.615239 1.23111 1.645795
C  3.117419 1.131911 1.206569
C  2.090997 -1.265497 -2.030588
C  -0.170208 -1.76461 -1.04706
C  0.44658 2.751423 1.708836
C  1.718889 -1.590737 1.3564
C  -1.016409 3.165695 1.916816
C  -1.881544 2.757676 0.75641
C  0.993018 -3.96202 1.433156
C  2.754436 -3.551012 0.192496
C  -1.766181 3.403964 -0.472224
C  -2.766183 1.688118 0.846932
C  1.509167 -5.10914 0.915367
C  -2.495697 2.995552 -1.575989
C  -3.502656 1.259886 -0.248501
C  -3.358682 1.916344 -1.458695
H  0.669616 0.858389 -2.315927
H  -0.393427 0.790502 -0.902419
H  0.800703 0.833838 2.641454
H  -0.319408 0.771115 1.314432
H  3.208393 2.214526 1.297239
H  3.884823 0.786232 0.514487
H  3.301984 0.696017 2.185279
H  2.972497 -0.6260 -1.982095
H  1.665473 -1.173295 -3.03095
H  2.401878 -2.300814 -1.917366
H  0.082747 -2.820691 -0.978389
H  -0.883019 -1.523311 -0.257246
H  -0.680397 -1.617115 -2.000732
H  1.049171 3.16513 2.520857
H  0.808297 3.218505 0.790956
H  -1.065125 4.249256 2.051375
H  -1.40096 2.724322 2.839928
H  0.156951 -3.769682 2.082636
H  3.560729 -2.990402 -0.25282
H  -1.087855 4.242739 -0.575152
H  -2.88389 1.170944 1.791851
H  1.148896 -6.116129 1.051545
H  -2.394903 3.510768 -2.521363
H  -4.183397 0.424439 -0.158654
totalener: -1513.49206290 hartree
nucrepener: 2476.91812237 hartree
electener: -3990.41018527 hartree
oneelecener: -6990.49155398 hartree
twoeener: 3000.08136871 hartree
kineticenergy: 1508.19355321 hartree
xcener: -124.310714575622 hartree
chargesum: -0.0000000
charge: -0.080098 -0.344092 -0.370551 -0.095226 -0.030910 -0.296706 0.350727 0.067081 0.140685 -0.249605 -0.289094 -0.351126 -0.320475 -0.167472 0.327182 -0.137974 0.095682 -0.126458 0.005061 -0.187339 -0.193791 -0.077260 -0.128399 -0.128144 0.082170 0.096332 0.002411 0.126296 0.055660 0.102102 0.093258 0.109812 0.117699 0.094365 0.115640 0.118052 0.095545 0.109312 0.090509 0.087477 0.098373 0.084386 0.144400 0.152170 0.113324 0.123615 0.129162 0.122764 0.123468
qa: -0.0801 -0.3441 -0.3706 -0.0952 -0.0309 -0.2967 0.3507 0.0671 0.1407 -0.2496 -0.2891 -0.3511 -0.3205 -0.1675 0.3272 -0.1380 0.0957 -0.1265 0.0051 -0.1873 -0.1938 -0.0773 -0.1284 -0.1281 0.0822 0.0963 0.0024 0.1263 0.0557 0.1021 0.0933 0.1098 0.1177 0.0944 0.1156 0.1181 0.0955 0.1093 0.0905 0.0875 0.0984 0.0844 0.1444 0.1522 0.1133 0.1236 0.1292 0.1228 0.1235
va: 1.2270 2.0167 2.1310 3.1325 3.2640 3.1277 4.0914 4.0245 3.9225 3.8475 3.9179 3.9308 3.9418 3.8458 4.2657 3.8935 3.5999 3.9181 4.0560 3.9667 3.9309 4.0250 3.9816 3.9716 3.8995 0.9964 1.0275 1.0383 1.0176 1.0041 1.0162 1.0147 1.0046 1.0089 1.0057 0.9969 1.0027 1.0079 1.0082 1.0288 1.0059 1.0097 1.0114 0.9920 1.0111 1.0070 1.0085 1.0115 1.0109
dispcorr: -0.031314490 hartree
energy: -1513.523377388317
dipole: 15.95011 -16.51684 -0.56673 4.11834 -2.77639 1.34195 7.84205 -8.04936 -0.20731
magnitude: 1.47139 au
magnitude: 3.73999 debye
