program: Orca
programVersion: 4.2.1
elementType: Cl O O N N N C C C C C C C C C C C C C C C C C C C H H H H H H H H H H H H H H H H H H H H H H H H
charge: 0
multiplicity: 1
keywords: wb97x-d3
keywords: def2-TZVPP
keywords: def2/J RIJCOSX GRIDX6 NOFINALGRIDX
keywords: grid4 nofinalgrid
keywords: scfconv7
keywords: smallprint printgap noloewdin
keywords: NOSOSCF
formula: C19H24ClN3O2
InChI: InChI=1/C19H24ClN3O2/c1-18(2)13-25-19(3,23(18)17(24)22-12-11-21-14-22)10-4-5-15-6-8-16(20)9-7-15/h6-9,11-12,14H,4-5,10,13H2,1-3H3
49 atoms
Cl -5.199704 -0.925027 -0.300581
O  3.149248 1.54392 0.696846
O  2.059231 -1.78314 -1.972139
N  2.548932 -0.442963 -0.198591
N  0.579339 -1.719974 -0.250573
N  -0.759783 -2.750628 1.167652
C  2.074971 0.636109 0.725988
C  3.927603 -0.159158 -0.647851
C  4.323836 0.820596 0.45311
C  0.844702 1.346678 0.169947
C  1.870722 0.153326 2.162163
C  4.803819 -1.4030 -0.625256
C  3.985949 0.537254 -2.008826
C  0.381788 2.552052 0.978466
C  1.782744 -1.315253 -0.896235
C  -0.862978 3.198373 0.358436
C  -1.995061 2.221908 0.187739
C  -0.667014 -1.741567 -0.832212
C  0.45813 -2.366355 0.94637
C  -2.415433 1.817174 -1.073931
C  -2.611511 1.646962 1.296315
C  -1.476849 -2.352659 0.072656
C  -3.408568 0.86239 -1.235192
C  -3.598912 0.686789 1.156751
C  -3.98944 0.296695 -0.114378
H  4.674724 0.28975 1.349841
H  5.106084 1.512595 0.139584
H  0.019531 0.637023 0.117619
H  1.062869 1.656515 -0.857418
H  0.903641 -0.323294 2.305206
H  1.92108 1.006746 2.837404
H  2.646025 -0.552057 2.461667
H  4.542622 -2.098878 -1.419294
H  4.723489 -1.922524 0.330431
H  5.8481 -1.11862 -0.765376
H  3.4029 1.458745 -2.009044
H  5.020228 0.800565 -2.237464
H  3.620602 -0.104108 -2.805714
H  0.147429 2.248121 2.002066
H  1.175643 3.29794 1.048797
H  -0.603442 3.62827 -0.612429
H  -1.179845 4.034313 0.987527
H  -0.856359 -1.308421 -1.798557
H  1.307325 -2.550393 1.585226
H  -1.95535 2.249682 -1.95442
H  -2.310402 1.944242 2.294098
H  -2.538508 -2.52482 -0.003684
H  -3.72212 0.558027 -2.224428
H  -4.057798 0.240612 2.028044
totalener: -1513.49174020 hartree
nucrepener: 2508.23332687 hartree
electener: -4021.72506707 hartree
oneelecener: -7053.49826948 hartree
twoeener: 3031.77320241 hartree
kineticenergy: 1508.19690168 hartree
xcener: -124.310261685601 hartree
chargesum: 0.0000000
charge: -0.086520 -0.329389 -0.357546 -0.088928 -0.024567 -0.295326 0.282955 0.117723 0.062886 -0.150023 -0.370311 -0.303417 -0.343510 -0.156605 0.311377 -0.137637 0.057822 -0.114218 0.011054 -0.134869 -0.171012 -0.073044 -0.166259 -0.101586 0.074387 0.065571 0.091430 0.045971 0.096382 0.127738 0.111512 0.095422 0.121966 0.085597 0.097360 0.099739 0.090708 0.121020 0.075895 0.094863 0.081109 0.103382 0.144480 0.145094 0.110018 0.110882 0.127045 0.122914 0.120464
qa: -0.0865 -0.3294 -0.3575 -0.0889 -0.0246 -0.2953 0.2830 0.1177 0.0629 -0.1500 -0.3703 -0.3034 -0.3435 -0.1566 0.3114 -0.1376 0.0578 -0.1142 0.0111 -0.1349 -0.1710 -0.0730 -0.1663 -0.1016 0.0744 0.0656 0.0914 0.0460 0.0964 0.1277 0.1115 0.0954 0.1220 0.0856 0.0974 0.0997 0.0907 0.1210 0.0759 0.0949 0.0811 0.1034 0.1445 0.1451 0.1100 0.1109 0.1270 0.1229 0.1205
va: 1.2163 2.0108 2.1419 3.0445 3.2576 3.1221 4.0556 4.0162 3.9601 3.8107 3.9463 3.8970 3.9127 3.8758 4.2838 3.8548 3.6084 3.8907 4.0432 3.9348 3.9889 3.9969 4.0119 3.9784 3.8889 1.0000 0.9943 1.0564 1.0123 0.9941 1.0120 1.0112 1.0130 1.0112 1.0029 1.0082 1.0053 1.0213 1.0034 1.0329 1.0120 1.0054 1.0149 0.9972 1.0102 1.0095 1.0205 1.0119 1.0120
dispcorr: -0.032205780 hartree
energy: -1513.523945979025
dipole: 34.03617 -32.61873 1.41744 13.63603 -12.04055 1.59548 3.32437 -3.00850 0.31587
magnitude: 2.15742 au
magnitude: 5.48373 debye
