program: Orca
programVersion: 4.2.1
elementType: Cl O O N N N C C C C C C C C C C C C C C C C C C C H H H H H H H H H H H H H H H H H H H H H H H H
charge: 0
multiplicity: 1
keywords: wb97x-d3
keywords: def2-TZVPP
keywords: def2/J RIJCOSX GRIDX6 NOFINALGRIDX
keywords: grid4 nofinalgrid
keywords: scfconv7
keywords: smallprint printgap noloewdin
keywords: NOSOSCF
formula: C19H24ClN3O2
InChI: InChI=1/C19H24ClN3O2/c1-18(2)13-25-19(3,23(18)17(24)22-12-11-21-14-22)10-4-5-15-6-8-16(20)9-7-15/h6-9,11-12,14H,4-5,10,13H2,1-3H3
49 atoms
Cl -5.209192 1.571517 -2.255565
O  1.143915 1.319366 -0.35503
O  2.170891 -1.588936 2.389459
N  1.74447 -0.745638 0.326384
N  2.513331 -2.953066 0.605677
N  2.484759 -5.131406 0.269487
C  1.408766 0.618327 0.834776
C  1.45344 -0.844147 -1.122362
C  0.588345 0.411662 -1.263367
C  0.163509 0.570889 1.732833
C  2.601605 1.285039 1.498639
C  2.707678 -0.689945 -1.981357
C  0.651875 -2.071318 -1.536279
C  -0.243815 1.890622 2.385198
C  2.133809 -1.703069 1.188772
C  -0.687799 3.023758 1.456386
C  -1.813895 2.656974 0.528243
C  3.668141 -3.258586 -0.071889
C  1.857641 -4.129056 0.80557
C  -1.704241 2.843567 -0.845541
C  -3.008268 2.132816 1.018297
C  3.621297 -4.605565 -0.271217
C  -2.740141 2.516432 -1.707899
C  -4.053507 1.796781 0.173767
C  -3.911845 1.989483 -1.191546
H  0.638529 0.838225 -2.265816
H  -0.465345 0.196025 -1.042078
H  0.345857 -0.142981 2.534265
H  -0.677796 0.172056 1.158104
H  2.807555 0.855755 2.475685
H  2.408342 2.349816 1.62737
H  3.48964 1.182082 0.875284
H  3.275146 0.198213 -1.703213
H  2.423302 -0.590396 -3.030107
H  3.358989 -1.557221 -1.913207
H  1.257944 -2.96999 -1.626714
H  -0.167026 -2.2666 -0.843637
H  0.21194 -1.885411 -2.51807
H  -1.059603 1.660801 3.076123
H  0.56499 2.257536 3.021943
H  0.155659 3.389643 0.870717
H  -1.004189 3.864039 2.082333
H  4.418698 -2.52181 -0.297358
H  0.919479 -4.176348 1.336743
H  -0.788816 3.253692 -1.253833
H  -3.136478 1.985062 2.084127
H  4.353066 -5.224051 -0.765759
H  -2.636654 2.672411 -2.773173
H  -4.973569 1.392854 0.573924
totalener: -1513.49093319 hartree
nucrepener: 2447.80455374 hartree
electener: -3961.29548693 hartree
oneelecener: -6932.22522245 hartree
twoeener: 2970.92973552 hartree
kineticenergy: 1508.19471093 hartree
xcener: -124.312239357001 hartree
chargesum: 0.0000000
charge: -0.084273 -0.345682 -0.370163 -0.082592 -0.026308 -0.292513 0.389446 0.131865 -0.003095 -0.271727 -0.324716 -0.346677 -0.332163 -0.186725 0.317669 -0.090261 0.078856 -0.150175 0.038852 -0.203673 -0.210149 -0.092232 -0.113818 -0.113475 0.075970 0.094738 0.087230 0.128442 0.083597 0.122324 0.098678 0.091033 0.114835 0.094752 0.108010 0.115022 0.101995 0.108788 0.090557 0.091477 0.078226 0.098595 0.160050 0.134722 0.120618 0.111719 0.128796 0.121194 0.122360
qa: -0.0843 -0.3457 -0.3702 -0.0826 -0.0263 -0.2925 0.3894 0.1319 -0.0031 -0.2717 -0.3247 -0.3467 -0.3322 -0.1867 0.3177 -0.0903 0.0789 -0.1502 0.0389 -0.2037 -0.2101 -0.0922 -0.1138 -0.1135 0.0760 0.0947 0.0872 0.1284 0.0836 0.1223 0.0987 0.0910 0.1148 0.0948 0.1080 0.1150 0.1020 0.1088 0.0906 0.0915 0.0782 0.0986 0.1600 0.1347 0.1206 0.1117 0.1288 0.1212 0.1224
va: 1.2226 1.9927 2.1289 3.1530 3.2614 3.1327 3.9168 3.9431 3.9860 3.9010 3.9426 3.9376 3.9507 3.9057 4.2793 3.8207 3.6002 3.9051 4.0538 3.9647 3.9971 4.0619 3.9753 3.9971 3.9333 0.9953 0.9858 1.0351 1.0070 1.0139 1.0000 1.0146 1.0055 1.0081 1.0124 0.9967 1.0051 1.0065 1.0070 1.0069 1.0199 1.0023 0.9918 1.0089 1.0119 1.0121 1.0106 1.0116 1.0113
dispcorr: -0.030872418 hartree
energy: -1513.521805611613
dipole: 21.18184 -20.91094 0.27090 3.29000 -1.87201 1.41800 5.18907 -5.76498 -0.57591
magnitude: 1.55428 au
magnitude: 3.95066 debye
